null
SMILES: CCCCc1c(\C=C\C(=O)N[C@@H](C)CCCc2cccnc2)ccc2ccc(OC)cc12
InChI Key: InChIKey=NKRDRGKMGRFQER-QGUORLBXSA-N
Activity Spreadsheet -- Enzyme Inhibition Constant Data from BindingDB
Found 1 hit for monomerid = 50013922
Trg + Lig
Ki
nM
ΔG°
kcal/mole
IC50
nM
Kd
nM
EC50/IC50
nM
koff
s-1
kon
M-1s-1
pHTemp
°C
Platelet-activating factor receptor
(Homo sapiens (Human))
BDBM50013922
(3-(1-Butyl-7-methoxy-naphthalen-2-yl)-N-(1-methyl-...)
Show SMILES CCCCc1c(\C=C\C(=O)N[C@@H](C)CCCc2cccnc2)ccc2ccc(OC)cc12
Show InChI InChI=1S/C28H34N2O2/c1-4-5-11-26-23(12-13-24-14-16-25(32-3)19-27(24)26)15-17-28(31)30-21(2)8-6-9-22-10-7-18-29-20-22/h7,10,12-21H,4-6,8-9,11H2,1-3H3,(H,30,31)/b17-15+/t21-/m0/s1
Reactome pathway
n/an/a 15n/an/an/an/an/an/a
Hoffmann-La Roche Inc.
Curated by ChEMBL
Assay Description
Inhibition of [3H]-PAF binding to platelet activating factor receptor citrate-treated dog blood
J Med Chem 33: 2856-64 (1990)
BindingDB Entry DOI: 10.7270/Q21V5CZJ