null
SMILES: CCCCCc1c(\C=C\C(=O)N[C@@H](C)CCCc2cccnc2)oc2cc(OC)ccc12
InChI Key: InChIKey=ICIIXQATMFKASU-APHAIJBRSA-N
Activity Spreadsheet -- Enzyme Inhibition Constant Data from BindingDB
Found 1 hit for monomerid = 50013928
Trg + Lig
Ki
nM
ΔG°
kcal/mole
IC50
nM
Kd
nM
EC50/IC50
nM
koff
s-1
kon
M-1s-1
pHTemp
°C
Platelet-activating factor receptor
(Homo sapiens (Human))
BDBM50013928
(3-(6-Methoxy-3-pentyl-benzofuran-2-yl)-N-(1-methyl...)
Show SMILES CCCCCc1c(\C=C\C(=O)N[C@@H](C)CCCc2cccnc2)oc2cc(OC)ccc12
Show InChI InChI=1S/C27H34N2O3/c1-4-5-6-12-23-24-14-13-22(31-3)18-26(24)32-25(23)15-16-27(30)29-20(2)9-7-10-21-11-8-17-28-19-21/h8,11,13-20H,4-7,9-10,12H2,1-3H3,(H,29,30)/b16-15+/t20-/m0/s1
Reactome pathway
n/an/a 40n/an/an/an/an/an/a
Hoffmann-La Roche Inc.
Curated by ChEMBL
Assay Description
Inhibition of [3H]-PAF binding to platelet activating factor receptor citrate-treated dog blood
J Med Chem 33: 2856-64 (1990)
BindingDB Entry DOI: 10.7270/Q21V5CZJ