BDBM50014015 2-{2-[2-(3-tert-Butoxycarbonylamino-2-hydroxy-4-phenyl-butylamino)-3-phenyl-propionylamino]-3-methyl-pentanoylamino}-3-phenyl-propionic acid methyl ester::CHEMBL3143731::CHEMBL428854
SMILES: CC[C@H](C)[C@H](NC(=O)[C@H](Cc1ccccc1)NC[C@H](O)[C@H](Cc1ccccc1)NC(=O)OC(C)(C)C)C(=O)N[C@@H](Cc1ccccc1)C(=O)OC
InChI Key: InChIKey=MYAVIZSWDHVTAO-UHFFFAOYSA-N
Data: 1 KI
Activity Spreadsheet -- Enzyme Inhibition Constant Data from BindingDB
Found 1 hit for monomerid = 50014015
Trg + Lig
Ki
nM
ΔG°
kcal/mole
IC50
nM
Kd
nM
EC50/IC50
nM
koff
s-1
kon
M-1s-1
pHTemp
°C
Human immunodeficiency virus type 1 protease
(Human immunodeficiency virus type 1)
BDBM50014015
(2-{2-[2-(3-tert-Butoxycarbonylamino-2-hydroxy-4-ph...)
Show SMILES CC[C@H](C)[C@H](NC(=O)[C@H](Cc1ccccc1)NC[C@H](O)[C@H](Cc1ccccc1)NC(=O)OC(C)(C)C)C(=O)N[C@@H](Cc1ccccc1)C(=O)OC |r|
Show InChI InChI=1S/C40H54N4O7/c1-7-27(2)35(37(47)42-33(38(48)50-6)25-30-21-15-10-16-22-30)44-36(46)32(24-29-19-13-9-14-20-29)41-26-34(45)31(23-28-17-11-8-12-18-28)43-39(49)51-40(3,4)5/h8-22,27,31-35,41,45H,7,23-26H2,1-6H3,(H,42,47)(H,43,49)(H,44,46)
0.600n/an/an/an/an/an/a6.4n/a
University of Wisconsin-Madison
Curated by ChEMBL
Assay Description
Inhibition of HIV protease at pH 6.4, 37 degree C
J Med Chem 33: 1285-8 (1990)
BindingDB Entry DOI: 10.7270/Q2SB44QS