BDBM50014335 CHEMBL1164066
SMILES: CC1(C)CC(=O)C2=C(C1)NC(=CC2c1ccccc1)c1ccccc1
InChI Key: InChIKey=DCKQOTCYLKBLLM-UHFFFAOYSA-N
Data: 2 IC50
Activity Spreadsheet -- Enzyme Inhibition Constant Data from BindingDB
Found 2 hits for monomerid = 50014335
Trg + Lig
Ki
nM
ΔG°
kcal/mole
IC50
nM
Kd
nM
EC50/IC50
nM
koff
s-1
kon
M-1s-1
pHTemp
°C
Calcium channel
(RAT)
BDBM50014335
(CHEMBL1164066)
Show SMILES CC1(C)CC(=O)C2=C(C1)NC(=CC2c1ccccc1)c1ccccc1 |c:6,11|
Show InChI InChI=1S/C23H23NO/c1-23(2)14-20-22(21(25)15-23)18(16-9-5-3-6-10-16)13-19(24-20)17-11-7-4-8-12-17/h3-13,18,24H,14-15H2,1-2H3
n/an/a 340n/an/an/an/an/an/a
Universidad Complutense
Curated by ChEMBL
Assay Description
Inhibition of rat Cav1.2 channel in rat mesenteric artery assessed as relaxation of 70 mM K+ induced contraction
J Med Chem 57: 4313-23 (2014)
Article DOI: 10.1021/jm500263v
BindingDB Entry DOI: 10.7270/Q22R3T6K
Voltage-gated calcium channel
(Homo sapiens (Human))
BDBM50014335
(CHEMBL1164066)
Show SMILES CC1(C)CC(=O)C2=C(C1)NC(=CC2c1ccccc1)c1ccccc1 |c:6,11|
Show InChI InChI=1S/C23H23NO/c1-23(2)14-20-22(21(25)15-23)18(16-9-5-3-6-10-16)13-19(24-20)17-11-7-4-8-12-17/h3-13,18,24H,14-15H2,1-2H3
Reactome pathway
n/an/a 2.80E+3n/an/an/an/an/an/a
Universidad Complutense
Curated by ChEMBL
Assay Description
Inhibition of human Cav1.3 channel in human SH-SY5Y cells assessed as 70 mM K+ induced calcium elevation compound treated 15 mins before stimulus by ...
J Med Chem 57: 4313-23 (2014)
Article DOI: 10.1021/jm500263v
BindingDB Entry DOI: 10.7270/Q22R3T6K