BDBM50014497 (S)-2-(2-fluoro-4-(((2-(hydroxymethyl)-4-oxo-3,4-dihydroquinazolin-6-yl)methyl)(prop-2-ynyl)amino)benzamido)pentanedioic acid::2-{2-Fluoro-4-[(2-hydroxymethyl-4-oxo-3,4-dihydro-quinazolin-6-ylmethyl)-prop-2-ynyl-amino]-benzoylamino}-pentanedioic acid::CHEMBL104410
SMILES: OCc1nc2ccc(CN(CC#C)c3ccc(C(=O)N[C@@H](CCC(O)=O)C(O)=O)c(F)c3)cc2c(=O)[nH]1
InChI Key: InChIKey=RZOKGLLXJIRPFE-FQEVSTJZSA-N
Data: 2 IC50
Activity Spreadsheet -- Enzyme Inhibition Constant Data from BindingDB
Found 2 hits for monomerid = 50014497
Trg + Lig
Ki
nM
ΔG°
kcal/mole
IC50
nM
Kd
nM
EC50/IC50
nM
koff
s-1
kon
M-1s-1
pHTemp
°C
Thymidylate synthase
(Homo sapiens (Human))
BDBM50014497
((S)-2-(2-fluoro-4-(((2-(hydroxymethyl)-4-oxo-3,4-d...)
Show SMILES OCc1nc2ccc(CN(CC#C)c3ccc(C(=O)N[C@@H](CCC(O)=O)C(O)=O)c(F)c3)cc2c(=O)[nH]1
Show InChI InChI=1S/C25H23FN4O7/c1-2-9-30(12-14-3-6-19-17(10-14)24(35)29-21(13-31)27-19)15-4-5-16(18(26)11-15)23(34)28-20(25(36)37)7-8-22(32)33/h1,3-6,10-11,20,31H,7-9,12-13H2,(H,28,34)(H,32,33)(H,36,37)(H,27,29,35)/t20-/m0/s1
NCI pathway
Reactome pathway
n/an/a 58n/an/an/an/an/an/a
Meerut Institute of Engineering and Technology
Curated by ChEMBL
Assay Description
Inhibition of thymidylate synthase
Eur J Med Chem 45: 1560-71 (2010)
Article DOI: 10.1016/j.ejmech.2009.12.065
BindingDB Entry DOI: 10.7270/Q2D50P61
Thymidylate synthase
(Mus musculus)
BDBM50014497
((S)-2-(2-fluoro-4-(((2-(hydroxymethyl)-4-oxo-3,4-d...)
Show SMILES OCc1nc2ccc(CN(CC#C)c3ccc(C(=O)N[C@@H](CCC(O)=O)C(O)=O)c(F)c3)cc2c(=O)[nH]1
Show InChI InChI=1S/C25H23FN4O7/c1-2-9-30(12-14-3-6-19-17(10-14)24(35)29-21(13-31)27-19)15-4-5-16(18(26)11-15)23(34)28-20(25(36)37)7-8-22(32)33/h1,3-6,10-11,20,31H,7-9,12-13H2,(H,28,34)(H,32,33)(H,36,37)(H,27,29,35)/t20-/m0/s1
Reactome pathway
n/an/a 58n/an/an/an/an/an/a
Institute of Cancer Research
Curated by ChEMBL
Assay Description
Concentration of the compound required to inhibit 50% activity of Thymidylate synthase was determined
J Med Chem 33: 3067-71 (1990)
BindingDB Entry DOI: 10.7270/Q2V40T5X