BDBM50015438 CHEMBL4092452
SMILES: CC1CCCCC1C(=O)NCC1NCCc2ccccc12
InChI Key: InChIKey=IHOBAOYMTBPAII-UHFFFAOYSA-N
Data: 1 EC50
Activity Spreadsheet -- Enzyme Inhibition Constant Data from BindingDB
Found 1 hit for monomerid = 50015438
Trg + Lig
Ki
nM
ΔG°
kcal/mole
IC50
nM
Kd
nM
EC50/IC50
nM
koff
s-1
kon
M-1s-1
pHTemp
°C
Mu-type opioid receptor
(Homo sapiens (Human))
BDBM50015438
(CHEMBL4092452)
Show SMILES CC1CCCCC1C(=O)NCC1NCCc2ccccc12
Show InChI InChI=1S/C15H15N3O5/c1-4-23-14(19)12-9(2)16-15(22-3)17-13(12)10-6-5-7-11(8-10)18(20)21/h5-8H,4H2,1-3H3
NCI pathway
Reactome pathway
n/an/an/an/a 1.00E+4n/an/an/an/a
National Health Research Institutes
Curated by ChEMBL
Assay Description
Agonist activity at human MOR expressed in CHO-K1 cells co-expressing Galpha 15 assessed as increase in intracellular calcium release incubated for 1...
Eur J Med Chem 126: 202-217 (2017)
BindingDB Entry DOI: 10.7270/Q2RB76TS