null
SMILES: CN(C)c1ccc(cc1)C1=NN(C(C1)c1ccccc1)c1ccc(cc1)S(=O)(=O)NC(=S)NCc1ccccc1
InChI Key: InChIKey=XDPGDIUQGLHHQP-UHFFFAOYSA-N
Activity Spreadsheet -- Enzyme Inhibition Constant Data from BindingDB
Found 1 hit for monomerid = 50015584
Trg + Lig
Ki
nM
ΔG°
kcal/mole
IC50
nM
Kd
nM
EC50/IC50
nM
koff
s-1
kon
M-1s-1
pHTemp
°C
Aldo-keto reductase family 1 member B1
(Rattus norvegicus)
BDBM50015584
(CHEMBL3260152)
Show SMILES CN(C)c1ccc(cc1)C1=NN(C(C1)c1ccccc1)c1ccc(cc1)S(=O)(=O)NC(=S)NCc1ccccc1 |t:10|
Show InChI InChI=1S/C31H31N5O2S2/c1-35(2)26-15-13-24(14-16-26)29-21-30(25-11-7-4-8-12-25)36(33-29)27-17-19-28(20-18-27)40(37,38)34-31(39)32-22-23-9-5-3-6-10-23/h3-20,30H,21-22H2,1-2H3,(H2,32,34,39)
Reactome pathway
n/an/a 90n/an/an/an/an/an/a
Jamia Hamdard (Hamdard University)
Curated by ChEMBL
Assay Description
Inhibition of aldose reductase in rat lens by spectrophotometer analysis
Eur J Med Chem 80: 209-17 (2014)
Article DOI: 10.1016/j.ejmech.2014.04.046
BindingDB Entry DOI: 10.7270/Q2PC33ZJ