BDBM50015856 3-Acetoxymethyl-7-formyloxy-5,5,8-trioxo-5lambda*6*-thia-1-aza-bicyclo[4.2.0]oct-2-ene-2-carboxylic acid tert-butyl ester::CHEMBL313754
SMILES: CC(=O)OCC1=C(N2[C@@H]([C@@H](OC=O)C2=O)S(=O)(=O)C1)C(=O)OC(C)(C)C
InChI Key: InChIKey=DEYBDQMVEJEJKS-WCQYABFASA-N
Data: 3 IC50
Activity Spreadsheet -- Enzyme Inhibition Constant Data from BindingDB
Found 3 hits for monomerid = 50015856
Trg + Lig
Ki
nM
ΔG°
kcal/mole
IC50
nM
Kd
nM
EC50/IC50
nM
koff
s-1
kon
M-1s-1
pHTemp
°C
Trypsin
(Bos taurus (bovine))
BDBM50015856
(3-Acetoxymethyl-7-formyloxy-5,5,8-trioxo-5lambda*6...)
Show SMILES CC(=O)OCC1=C(N2[C@@H]([C@@H](OC=O)C2=O)S(=O)(=O)C1)C(=O)OC(C)(C)C |t:5|
Show InChI InChI=1S/C15H19NO9S/c1-8(18)23-5-9-6-26(21,22)13-11(24-7-17)12(19)16(13)10(9)14(20)25-15(2,3)4/h7,11,13H,5-6H2,1-4H3/t11-,13+/m0/s1
n/an/a>4.00E+4n/an/an/an/an/an/a
Merck Sharp and Dohme Research Laboratories
Curated by ChEMBL
Assay Description
Inhibitory concentration which is required to cause 50% inhibition of bovine trypsin (Trp)
J Med Chem 33: 2513-21 (1990)
BindingDB Entry DOI: 10.7270/Q2Q81C2Q
Pancreatic elastase
(Sus scrofa (Pig))
BDBM50015856
(3-Acetoxymethyl-7-formyloxy-5,5,8-trioxo-5lambda*6...)
Show SMILES CC(=O)OCC1=C(N2[C@@H]([C@@H](OC=O)C2=O)S(=O)(=O)C1)C(=O)OC(C)(C)C |t:5|
Show InChI InChI=1S/C15H19NO9S/c1-8(18)23-5-9-6-26(21,22)13-11(24-7-17)12(19)16(13)10(9)14(20)25-15(2,3)4/h7,11,13H,5-6H2,1-4H3/t11-,13+/m0/s1
n/an/a 400n/an/an/an/an/an/a
Merck Sharp and Dohme Research Laboratories
Curated by ChEMBL
Assay Description
Inhibitory concentration which is required to cause 50% inhibition of porcine pancreatic elastase (PPE)
J Med Chem 33: 2513-21 (1990)
BindingDB Entry DOI: 10.7270/Q2Q81C2Q
Leukocyte elastase
(Homo sapiens (Human))
BDBM50015856
(3-Acetoxymethyl-7-formyloxy-5,5,8-trioxo-5lambda*6...)
Show SMILES CC(=O)OCC1=C(N2[C@@H]([C@@H](OC=O)C2=O)S(=O)(=O)C1)C(=O)OC(C)(C)C |t:5|
Show InChI InChI=1S/C15H19NO9S/c1-8(18)23-5-9-6-26(21,22)13-11(24-7-17)12(19)16(13)10(9)14(20)25-15(2,3)4/h7,11,13H,5-6H2,1-4H3/t11-,13+/m0/s1
Reactome pathway
n/an/a 300n/an/an/an/an/an/a
Merck Sharp and Dohme Research Laboratories
Curated by ChEMBL
Assay Description
Inhibitory concentration which is required to cause 50% inhibition of human leukocyte elastase (HLE) enzyme
J Med Chem 33: 2513-21 (1990)
BindingDB Entry DOI: 10.7270/Q2Q81C2Q