BDBM50016005 6-Methyl-5,6,6a,7-tetrahydro-4H-dibenzo[de,g]quinolin-11-ol::CHEMBL157879
SMILES: CN1CCc2cccc-3c2[C@@H]1Cc1cccc(O)c-31
InChI Key: InChIKey=PCGXWSCASZVBJT-AWEZNQCLSA-N
Data: 2 IC50
Activity Spreadsheet -- Enzyme Inhibition Constant Data from BindingDB
Found 2 hits for monomerid = 50016005
Trg + Lig
Ki
nM
ΔG°
kcal/mole
IC50
nM
Kd
nM
EC50/IC50
nM
koff
s-1
kon
M-1s-1
pHTemp
°C
D(1A) dopamine receptor
(RAT)
BDBM50016005
(6-Methyl-5,6,6a,7-tetrahydro-4H-dibenzo[de,g]quino...)
Show SMILES CN1CCc2cccc-3c2[C@@H]1Cc1cccc(O)c-31
Show InChI InChI=1S/C17H17NO/c1-18-9-8-11-4-2-6-13-16(11)14(18)10-12-5-3-7-15(19)17(12)13/h2-7,14,19H,8-10H2,1H3/t14-/m0/s1
n/an/a 5.06E+3n/an/an/an/an/an/a
Lilly Research Laboratories
Curated by ChEMBL
Assay Description
In vitro binding affinity towards rat Dopamine receptor D1 by [3H]-SCH-23,390 displacement.
J Med Chem 33: 600-7 (1990)
BindingDB Entry DOI: 10.7270/Q2XS5TCP
D(2) dopamine receptor
(Rattus norvegicus (rat))
BDBM50016005
(6-Methyl-5,6,6a,7-tetrahydro-4H-dibenzo[de,g]quino...)
Show SMILES CN1CCc2cccc-3c2[C@@H]1Cc1cccc(O)c-31
Show InChI InChI=1S/C17H17NO/c1-18-9-8-11-4-2-6-13-16(11)14(18)10-12-5-3-7-15(19)17(12)13/h2-7,14,19H,8-10H2,1H3/t14-/m0/s1
Reactome pathway
n/an/a 2.24E+3n/an/an/an/an/an/a
Lilly Research Laboratories
Curated by ChEMBL
Assay Description
In vitro binding affinity towards rat Dopamine receptor D2 by [3H]-spiperone displacement.
J Med Chem 33: 600-7 (1990)
BindingDB Entry DOI: 10.7270/Q2XS5TCP