BDBM50016096 CHEMBL3261193
SMILES: [O-][N+](=O)c1cnc(\C=C/c2cccc3ccccc23)n1CCOC(=O)c1cccc2OCCOc12
InChI Key: InChIKey=BFLIYLBHNPHPPH-QXMHVHEDSA-N
Data: 1 IC50
Activity Spreadsheet -- Enzyme Inhibition Constant Data from BindingDB
Found 1 hit for monomerid = 50016096
Trg + Lig
Ki
nM
ΔG°
kcal/mole
IC50
nM
Kd
nM
EC50/IC50
nM
koff
s-1
kon
M-1s-1
pHTemp
°C
Focal adhesion kinase 1
(Homo sapiens (Human))
BDBM50016096
(CHEMBL3261193)
Show SMILES [O-][N+](=O)c1cnc(\C=C/c2cccc3ccccc23)n1CCOC(=O)c1cccc2OCCOc12
Show InChI InChI=1S/C26H21N3O6/c30-26(21-9-4-10-22-25(21)34-16-15-33-22)35-14-13-28-23(27-17-24(28)29(31)32)12-11-19-7-3-6-18-5-1-2-8-20(18)19/h1-12,17H,13-16H2/b12-11-
NCI pathway
Reactome pathway
n/an/a 1.01E+3n/an/an/an/an/an/a
Nanjing University
Curated by ChEMBL
Assay Description
Inhibition of FAK (unknown origin) assembly after 20 mins by turbidimetric method
Bioorg Med Chem 22: 2947-54 (2014)
Article DOI: 10.1016/j.bmc.2014.04.005
BindingDB Entry DOI: 10.7270/Q25B041Q