null
SMILES: CCOC(=O)c1sc(nc1NC)-c1ccncc1
InChI Key: InChIKey=NJSOSCMVUBKBNW-UHFFFAOYSA-N
Activity Spreadsheet -- Enzyme Inhibition Constant Data from BindingDB
Found 2 hits for monomerid = 50016119
Trg + Lig
Ki
nM
ΔG°
kcal/mole
IC50
nM
Kd
nM
EC50/IC50
nM
koff
s-1
kon
M-1s-1
pHTemp
°C
Cyclin-dependent kinase 2/G1/S-specific cyclin-E1
(Homo sapiens (Human))
BDBM50016119
(CHEMBL3261231)
Show SMILES CCOC(=O)c1sc(nc1NC)-c1ccncc1
Show InChI InChI=1S/C12H13N3O2S/c1-3-17-12(16)9-10(13-2)15-11(18-9)8-4-6-14-7-5-8/h4-7,13H,3H2,1-2H3
n/an/a>1.25E+5n/an/an/an/an/an/a
Amgen, Inc.
Curated by ChEMBL
Assay Description
Inhibition of CDK2/Cyclin-E (unknown origin) using maltose binding protein as substrate by HTRF assay
Eur J Med Chem 80: 364-82 (2014)
Article DOI: 10.1016/j.ejmech.2014.04.013
BindingDB Entry DOI: 10.7270/Q2NC62R8
Cell division cycle 7-related protein kinase/Protein DBF4 homolog A
(Homo sapiens (Human))
BDBM50016119
(CHEMBL3261231)
Show SMILES CCOC(=O)c1sc(nc1NC)-c1ccncc1
Show InChI InChI=1S/C12H13N3O2S/c1-3-17-12(16)9-10(13-2)15-11(18-9)8-4-6-14-7-5-8/h4-7,13H,3H2,1-2H3
n/an/a 7.35E+3n/an/an/an/an/an/a
Amgen, Inc.
Curated by ChEMBL
Assay Description
Inhibition of Cdc7/Dbf4 (unknown origin)-mediated phosphorylation of MCM2 by protein-A luminescent proximity homogenous assay
Eur J Med Chem 80: 364-82 (2014)
Article DOI: 10.1016/j.ejmech.2014.04.013
BindingDB Entry DOI: 10.7270/Q2NC62R8