null
SMILES: CCOC(=O)c1sc(nc1Nc1ccccc1)-c1ccncc1
InChI Key: InChIKey=JXELUNOJENGIHA-UHFFFAOYSA-N
Activity Spreadsheet -- Enzyme Inhibition Constant Data from BindingDB
Found 2 hits for monomerid = 50016121
Trg + Lig
Ki
nM
ΔG°
kcal/mole
IC50
nM
Kd
nM
EC50/IC50
nM
koff
s-1
kon
M-1s-1
pHTemp
°C
Cyclin-dependent kinase 2/G1/S-specific cyclin-E1
(Homo sapiens (Human))
BDBM50016121
(CHEMBL3261233)
Show SMILES CCOC(=O)c1sc(nc1Nc1ccccc1)-c1ccncc1
Show InChI InChI=1S/C17H15N3O2S/c1-2-22-17(21)14-15(19-13-6-4-3-5-7-13)20-16(23-14)12-8-10-18-11-9-12/h3-11,19H,2H2,1H3
n/an/a>1.25E+5n/an/an/an/an/an/a
Amgen, Inc.
Curated by ChEMBL
Assay Description
Inhibition of CDK2/Cyclin-E (unknown origin) using maltose binding protein as substrate by HTRF assay
Eur J Med Chem 80: 364-82 (2014)
Article DOI: 10.1016/j.ejmech.2014.04.013
BindingDB Entry DOI: 10.7270/Q2NC62R8
Cell division cycle 7-related protein kinase/Protein DBF4 homolog A
(Homo sapiens (Human))
BDBM50016121
(CHEMBL3261233)
Show SMILES CCOC(=O)c1sc(nc1Nc1ccccc1)-c1ccncc1
Show InChI InChI=1S/C17H15N3O2S/c1-2-22-17(21)14-15(19-13-6-4-3-5-7-13)20-16(23-14)12-8-10-18-11-9-12/h3-11,19H,2H2,1H3
n/an/a>1.25E+5n/an/an/an/an/an/a
Amgen, Inc.
Curated by ChEMBL
Assay Description
Inhibition of Cdc7/Dbf4 (unknown origin)-mediated phosphorylation of MCM2 by protein-A luminescent proximity homogenous assay
Eur J Med Chem 80: 364-82 (2014)
Article DOI: 10.1016/j.ejmech.2014.04.013
BindingDB Entry DOI: 10.7270/Q2NC62R8