null
SMILES: CCOC(=O)c1sc(nc1-c1ccccc1)-c1cc(N)ncn1
InChI Key: InChIKey=AVKBTUTVWVNTNE-UHFFFAOYSA-N
Activity Spreadsheet -- Enzyme Inhibition Constant Data from BindingDB
Found 2 hits for monomerid = 50016154
Trg + Lig
Ki
nM
ΔG°
kcal/mole
IC50
nM
Kd
nM
EC50/IC50
nM
koff
s-1
kon
M-1s-1
pHTemp
°C
Cyclin-dependent kinase 2/G1/S-specific cyclin-E1
(Homo sapiens (Human))
BDBM50016154
(CHEMBL3261506)
Show SMILES CCOC(=O)c1sc(nc1-c1ccccc1)-c1cc(N)ncn1
Show InChI InChI=1S/C16H14N4O2S/c1-2-22-16(21)14-13(10-6-4-3-5-7-10)20-15(23-14)11-8-12(17)19-9-18-11/h3-9H,2H2,1H3,(H2,17,18,19)
n/an/a>1.25E+5n/an/an/an/an/an/a
Amgen, Inc.
Curated by ChEMBL
Assay Description
Inhibition of CDK2/Cyclin-E (unknown origin) using maltose binding protein as substrate by HTRF assay
Eur J Med Chem 80: 364-82 (2014)
Article DOI: 10.1016/j.ejmech.2014.04.013
BindingDB Entry DOI: 10.7270/Q2NC62R8
Cell division cycle 7-related protein kinase/Protein DBF4 homolog A
(Homo sapiens (Human))
BDBM50016154
(CHEMBL3261506)
Show SMILES CCOC(=O)c1sc(nc1-c1ccccc1)-c1cc(N)ncn1
Show InChI InChI=1S/C16H14N4O2S/c1-2-22-16(21)14-13(10-6-4-3-5-7-10)20-15(23-14)11-8-12(17)19-9-18-11/h3-9H,2H2,1H3,(H2,17,18,19)
n/an/a>1.25E+5n/an/an/an/an/an/a
Amgen, Inc.
Curated by ChEMBL
Assay Description
Inhibition of Cdc7/Dbf4 (unknown origin)-mediated phosphorylation of MCM2 by protein-A luminescent proximity homogenous assay
Eur J Med Chem 80: 364-82 (2014)
Article DOI: 10.1016/j.ejmech.2014.04.013
BindingDB Entry DOI: 10.7270/Q2NC62R8