null
SMILES: COc1ccc(\C=C2/SC(=S)N(CC(O)=O)C2=O)cc1OCC(N)=O
InChI Key: InChIKey=HKBMXHMSCHIABN-WZUFQYTHSA-N
Activity Spreadsheet -- Enzyme Inhibition Constant Data from BindingDB
Found 3 hits for monomerid = 50016231
Trg + Lig
Ki
nM
ΔG°
kcal/mole
IC50
nM
Kd
nM
EC50/IC50
nM
koff
s-1
kon
M-1s-1
pHTemp
°C
Aldo-keto reductase family 1 member B1 [K65Q]
(Bos taurus (Cattle))
BDBM50016231
(CHEMBL3262477)
Show SMILES COc1ccc(\C=C2/SC(=S)N(CC(O)=O)C2=O)cc1OCC(N)=O
Show InChI InChI=1S/C15H14N2O6S2/c1-22-9-3-2-8(4-10(9)23-7-12(16)18)5-11-14(21)17(6-13(19)20)15(24)25-11/h2-5H,6-7H2,1H3,(H2,16,18)(H,19,20)/b11-5-
n/an/a 130n/an/an/an/an/an/a
University of Messina
Curated by ChEMBL
Assay Description
Inhibition of bovine aldose reductase assessed as oxidation of NADPH
Eur J Med Chem 81: 1-14 (2014)
Article DOI: 10.1016/j.ejmech.2014.05.003
BindingDB Entry DOI: 10.7270/Q2833TJC
Aldo-keto reductase family 1 member B1
(Homo sapiens (Human))
BDBM50016231
(CHEMBL3262477)
Show SMILES COc1ccc(\C=C2/SC(=S)N(CC(O)=O)C2=O)cc1OCC(N)=O
Show InChI InChI=1S/C15H14N2O6S2/c1-22-9-3-2-8(4-10(9)23-7-12(16)18)5-11-14(21)17(6-13(19)20)15(24)25-11/h2-5H,6-7H2,1H3,(H2,16,18)(H,19,20)/b11-5-
n/an/a 139n/an/an/an/an/an/a
University of Messina
Curated by ChEMBL
Assay Description
Inhibition of human recombinant aldose reductase expressed in Escherichia coli BL21 (DE3) pLysS assessed as reduction in NADPH oxidation using L-idos...
Bioorg Med Chem Lett 28: 3712-3720 (2018)
Article DOI: 10.1016/j.bmcl.2018.10.024
Tyrosine-protein phosphatase non-receptor type 1
(Homo sapiens (Human))
BDBM50016231
(CHEMBL3262477)
Show SMILES COc1ccc(\C=C2/SC(=S)N(CC(O)=O)C2=O)cc1OCC(N)=O
Show InChI InChI=1S/C15H14N2O6S2/c1-22-9-3-2-8(4-10(9)23-7-12(16)18)5-11-14(21)17(6-13(19)20)15(24)25-11/h2-5H,6-7H2,1H3,(H2,16,18)(H,19,20)/b11-5-
NCI pathway
Reactome pathway
n/an/a 6.79E+5n/an/an/an/an/an/a
University of Messina
Curated by ChEMBL
Assay Description
Inhibition of human full-length GST-fused PTP1B expressed in bacterial expression system using pNPP as substrate
Bioorg Med Chem Lett 28: 3712-3720 (2018)
Article DOI: 10.1016/j.bmcl.2018.10.024