null
SMILES: NC(=O)COc1ccc(\C=C2/SC(=S)N(CC(O)=O)C2=O)cc1
InChI Key: InChIKey=LNUUVOYTGLGONO-YHYXMXQVSA-N
Activity Spreadsheet -- Enzyme Inhibition Constant Data from BindingDB
Found 2 hits for monomerid = 50016232
Trg + Lig
Ki
nM
ΔG°
kcal/mole
IC50
nM
Kd
nM
EC50/IC50
nM
koff
s-1
kon
M-1s-1
pHTemp
°C
Aldo-keto reductase family 1 member B1
(Homo sapiens (Human))
BDBM50016232
(CHEMBL3262476)
Show SMILES NC(=O)COc1ccc(\C=C2/SC(=S)N(CC(O)=O)C2=O)cc1
Show InChI InChI=1S/C14H12N2O5S2/c15-11(17)7-21-9-3-1-8(2-4-9)5-10-13(20)16(6-12(18)19)14(22)23-10/h1-5H,6-7H2,(H2,15,17)(H,18,19)/b10-5-
n/an/a 194n/an/an/an/an/an/a
University of Messina
Curated by ChEMBL
Assay Description
Inhibition of human recombinant aldose reductase expressed in Escherichia coli BL21 (DE3) pLysS assessed as reduction in NADPH oxidation using L-idos...
Bioorg Med Chem Lett 28: 3712-3720 (2018)
Article DOI: 10.1016/j.bmcl.2018.10.024
Aldo-keto reductase family 1 member B1 [K65Q]
(Bos taurus (Cattle))
BDBM50016232
(CHEMBL3262476)
Show SMILES NC(=O)COc1ccc(\C=C2/SC(=S)N(CC(O)=O)C2=O)cc1
Show InChI InChI=1S/C14H12N2O5S2/c15-11(17)7-21-9-3-1-8(2-4-9)5-10-13(20)16(6-12(18)19)14(22)23-10/h1-5H,6-7H2,(H2,15,17)(H,18,19)/b10-5-
n/an/a 130n/an/an/an/an/an/a
University of Messina
Curated by ChEMBL
Assay Description
Inhibition of bovine aldose reductase assessed as oxidation of NADPH
Eur J Med Chem 81: 1-14 (2014)
Article DOI: 10.1016/j.ejmech.2014.05.003
BindingDB Entry DOI: 10.7270/Q2833TJC