BDBM50016236 CHEMBL3262472
SMILES: NC(=O)COc1ccc(\C=C2/SC(=O)N(CC(O)=O)C2=O)cc1
InChI Key: InChIKey=LLBITPNSTOVFFO-YHYXMXQVSA-N
Data: 1 IC50
Activity Spreadsheet -- Enzyme Inhibition Constant Data from BindingDB
Found 1 hit for monomerid = 50016236
Trg + Lig
Ki
nM
ΔG°
kcal/mole
IC50
nM
Kd
nM
EC50/IC50
nM
koff
s-1
kon
M-1s-1
pHTemp
°C
Aldose reductase (ALR2)
(Bos taurus (Cattle))
BDBM50016236
(CHEMBL3262472)
Show SMILES NC(=O)COc1ccc(\C=C2/SC(=O)N(CC(O)=O)C2=O)cc1
Show InChI InChI=1S/C14H12N2O6S/c15-11(17)7-22-9-3-1-8(2-4-9)5-10-13(20)16(6-12(18)19)14(21)23-10/h1-5H,6-7H2,(H2,15,17)(H,18,19)/b10-5-
n/an/a 560n/an/an/an/an/an/a
University of Messina
Curated by ChEMBL
Assay Description
Inhibition of bovine aldose reductase assessed as oxidation of NADPH
Eur J Med Chem 81: 1-14 (2014)
Article DOI: 10.1016/j.ejmech.2014.05.003
BindingDB Entry DOI: 10.7270/Q2833TJC