BDBM50016242 CHEMBL3262465
SMILES: COc1ccc(\C=C2/SC(=O)NC2=O)cc1OCC(N)=O
InChI Key: InChIKey=HBSZIOAQHMMESL-YHYXMXQVSA-N
Data: 1 IC50
Activity Spreadsheet -- Enzyme Inhibition Constant Data from BindingDB
Found 1 hit for monomerid = 50016242
Trg + Lig
Ki
nM
ΔG°
kcal/mole
IC50
nM
Kd
nM
EC50/IC50
nM
koff
s-1
kon
M-1s-1
pHTemp
°C
Aldose reductase (ALR2)
(Bos taurus (Cattle))
BDBM50016242
(CHEMBL3262465)
Show SMILES COc1ccc(\C=C2/SC(=O)NC2=O)cc1OCC(N)=O
Show InChI InChI=1S/C13H12N2O5S/c1-19-8-3-2-7(4-9(8)20-6-11(14)16)5-10-12(17)15-13(18)21-10/h2-5H,6H2,1H3,(H2,14,16)(H,15,17,18)/b10-5-
n/an/a 2.26E+4n/an/an/an/an/an/a
University of Messina
Curated by ChEMBL
Assay Description
Inhibition of bovine aldose reductase assessed as oxidation of NADPH
Eur J Med Chem 81: 1-14 (2014)
Article DOI: 10.1016/j.ejmech.2014.05.003
BindingDB Entry DOI: 10.7270/Q2833TJC