BDBM50016410 2,6,9,11,13,14-hexahydroxy-11-(2-hydroxy-1-methylethyl)-3,7,10-trimethyl-(6S,7S,10R,11S,13S,14R)-15-oxapentacyclo[7.5.1.01,6.07,13.010,14]pentadec-12-yl 1H-2-pyrrolecarboxylate::CHEMBL163108::EPIRYANODINE
SMILES: CC(C)[C@@]1(O)[C@@H](OC(=O)c2ccc[nH]2)[C@@]2(O)[C@@]3(C)C[C@]4(O)O[C@@]5([C@H](O)[C@H](C)CC[C@]35O)[C@@]2(O)[C@]14C
InChI Key: InChIKey=KIFLYJJBQSTPLB-KYEHZBLFSA-N
Data: 1 IC50
Activity Spreadsheet -- Enzyme Inhibition Constant Data from BindingDB
Found 1 hit for monomerid = 50016410
Trg + Lig
Ki
nM
ΔG°
kcal/mole
IC50
nM
Kd
nM
EC50/IC50
nM
koff
s-1
kon
M-1s-1
pHTemp
°C
Ryanodine receptor 1
(Oryctolagus cuniculus)
BDBM50016410
(2,6,9,11,13,14-hexahydroxy-11-(2-hydroxy-1-methyle...)
Show SMILES CC(C)[C@@]1(O)[C@@H](OC(=O)c2ccc[nH]2)[C@@]2(O)[C@@]3(C)C[C@]4(O)O[C@@]5([C@H](O)[C@H](C)CC[C@]35O)[C@@]2(O)[C@]14C |r,THB:33:19:29:31.14,20:19:29:31.14|
Show InChI InChI=1S/C25H35NO10/c1-12-7-8-20(30)18(3)11-21(31)19(4)22(32,13(2)10-27)17(35-16(29)14-6-5-9-26-14)23(18,33)25(19,34)24(20,36-21)15(12)28/h5-6,9,12-13,15,17,26-28,30-34H,7-8,10-11H2,1-4H3/t12-,13?,15+,17+,18-,19+,20-,21-,22+,23+,24+,25+/m0/s1
NCI pathway
Reactome pathway
n/an/a 41n/an/an/an/an/an/a
TBA
Curated by ChEMBL
Assay Description
Displacement of [3H]ryanodine from Ca2+-ryanodine receptor in Oryctolagus cuniculus (rabbit) skeletal muscle sarcoplasmic reticulum after 80 min by c...
J Med Chem 30: 710-6 (1987)
BindingDB Entry DOI: 10.7270/Q26M37D3