BDBM50016516 CHEMBL3260691
SMILES: CCOC(=O)c1c(CSc2c(C)cc(C)cc2C)n(C)c2ccc(O)cc12
InChI Key: InChIKey=GEQORWFVFVYZQD-UHFFFAOYSA-N
Data: 3 IC50
Activity Spreadsheet -- Enzyme Inhibition Constant Data from BindingDB
Found 3 hits for monomerid = 50016516
Trg + Lig
Ki
nM
ΔG°
kcal/mole
IC50
nM
Kd
nM
EC50/IC50
nM
koff
s-1
kon
M-1s-1
pHTemp
°C
Arachidonate 5-lipoxygenase
(Homo sapiens (Human))
BDBM50016516
(CHEMBL3260691)
Show SMILES CCOC(=O)c1c(CSc2c(C)cc(C)cc2C)n(C)c2ccc(O)cc12
Show InChI InChI=1S/C22H25NO3S/c1-6-26-22(25)20-17-11-16(24)7-8-18(17)23(5)19(20)12-27-21-14(3)9-13(2)10-15(21)4/h7-11,24H,6,12H2,1-5H3
Reactome pathway
n/an/a 230n/an/an/an/an/an/a
University of Naples
Curated by ChEMBL
Assay Description
Inhibition of 5-LO in human polymorphonuclear leukocytes assessed as inhibition of LTB4 production from arachidonic acid preincubated for 15 mins by ...
Eur J Med Chem 81: 492-8 (2014)
Article DOI: 10.1016/j.ejmech.2014.05.033
BindingDB Entry DOI: 10.7270/Q2TX3GXD
Arachidonate 15-lipoxygenase
(Homo sapiens (Human))
BDBM50016516
(CHEMBL3260691)
Show SMILES CCOC(=O)c1c(CSc2c(C)cc(C)cc2C)n(C)c2ccc(O)cc12
Show InChI InChI=1S/C22H25NO3S/c1-6-26-22(25)20-17-11-16(24)7-8-18(17)23(5)19(20)12-27-21-14(3)9-13(2)10-15(21)4/h7-11,24H,6,12H2,1-5H3
Reactome pathway
n/an/a 8.20E+3n/an/an/an/an/an/a
University of Naples
Curated by ChEMBL
Assay Description
Inhibition of 15-LO in human polymorphonuclear leukocytes assessed as inhibition of 15-H(P)ETE production from arachidonic acid preincubated for 15 m...
Eur J Med Chem 81: 492-8 (2014)
Article DOI: 10.1016/j.ejmech.2014.05.033
BindingDB Entry DOI: 10.7270/Q2TX3GXD
Arachidonate 5-lipoxygenase
(Homo sapiens (Human))
BDBM50016516
(CHEMBL3260691)
Show SMILES CCOC(=O)c1c(CSc2c(C)cc(C)cc2C)n(C)c2ccc(O)cc12
Show InChI InChI=1S/C22H25NO3S/c1-6-26-22(25)20-17-11-16(24)7-8-18(17)23(5)19(20)12-27-21-14(3)9-13(2)10-15(21)4/h7-11,24H,6,12H2,1-5H3
Reactome pathway
n/an/a 700n/an/an/an/an/an/a
University of Naples
Curated by ChEMBL
Assay Description
Inhibition of human recombinant 5-LO expressed in Escherichia coli BL21 using arachidonic acid as substrate preincubated for 5 to 10 mins by HPLC ana...
Eur J Med Chem 81: 492-8 (2014)
Article DOI: 10.1016/j.ejmech.2014.05.033
BindingDB Entry DOI: 10.7270/Q2TX3GXD