BDBM50016634 5-(5-Chloro-2-methanesulfonyl-phenyl)-imidazolidine-2,4-dione::CHEMBL277520
SMILES: CS(=O)(=O)c1ccc(Cl)cc1-c1[nH]c(=O)[nH]c1O
InChI Key: InChIKey=MIRRKJQPILLVDW-UHFFFAOYSA-N
Data: 1 IC50
Activity Spreadsheet -- Enzyme Inhibition Constant Data from BindingDB
Found 1 hit for monomerid = 50016634
Trg + Lig
Ki
nM
ΔG°
kcal/mole
IC50
nM
Kd
nM
EC50/IC50
nM
koff
s-1
kon
M-1s-1
pHTemp
°C
Aldose reductase (AR)
(Homo sapiens (Human))
BDBM50016634
(5-(5-Chloro-2-methanesulfonyl-phenyl)-imidazolidin...)
Show SMILES CS(=O)(=O)c1ccc(Cl)cc1-c1[nH]c(=O)[nH]c1O
Show InChI InChI=1S/C10H9ClN2O4S/c1-18(16,17)7-3-2-5(11)4-6(7)8-9(14)13-10(15)12-8/h2-4,14H,1H3,(H2,12,13,15)
n/an/a 50n/an/an/an/an/an/a
Pfizer Inc.
Curated by ChEMBL
Assay Description
Compound was evaluated for inhibition of human placental aldose reductase (HPAR) activity with glyceraldehyde as substrate
J Med Chem 32: 1208-13 (1989)
BindingDB Entry DOI: 10.7270/Q24B309G