BDBM50016655 5-[5-Chloro-2-(propane-2-sulfonyl)-phenyl]-imidazolidine-2,4-dione::CHEMBL18865
SMILES: CC(C)S(=O)(=O)c1ccc(Cl)cc1-c1[nH]c(=O)[nH]c1O
InChI Key: InChIKey=FAPGKBXCNJMNBF-UHFFFAOYSA-N
Data: 1 IC50
Activity Spreadsheet -- Enzyme Inhibition Constant Data from BindingDB
Found 1 hit for monomerid = 50016655
Trg + Lig
Ki
nM
ΔG°
kcal/mole
IC50
nM
Kd
nM
EC50/IC50
nM
koff
s-1
kon
M-1s-1
pHTemp
°C
Aldose reductase (AR)
(Homo sapiens (Human))
BDBM50016655
(5-[5-Chloro-2-(propane-2-sulfonyl)-phenyl]-imidazo...)
Show SMILES CC(C)S(=O)(=O)c1ccc(Cl)cc1-c1[nH]c(=O)[nH]c1O
Show InChI InChI=1S/C12H13ClN2O4S/c1-6(2)20(18,19)9-4-3-7(13)5-8(9)10-11(16)15-12(17)14-10/h3-6,16H,1-2H3,(H2,14,15,17)
n/an/a 380n/an/an/an/an/an/a
Pfizer Inc.
Curated by ChEMBL
Assay Description
Inhibition of human placental aldose reductase (HPAR) activity with glyceraldehyde as substrate
J Med Chem 32: 1208-13 (1989)
BindingDB Entry DOI: 10.7270/Q24B309G