BDBM50016656 5-(3,5-Dichloro-2-methanesulfonyl-phenyl)-imidazolidine-2,4-dione::CHEMBL277427
SMILES: CS(=O)(=O)c1c(Cl)cc(Cl)cc1-c1[nH]c(=O)[nH]c1O
InChI Key: InChIKey=YFLCZGRLMSGXPE-UHFFFAOYSA-N
Data: 1 IC50
Activity Spreadsheet -- Enzyme Inhibition Constant Data from BindingDB
Found 1 hit for monomerid = 50016656
Trg + Lig
Ki
nM
ΔG°
kcal/mole
IC50
nM
Kd
nM
EC50/IC50
nM
koff
s-1
kon
M-1s-1
pHTemp
°C
Aldose reductase (AR)
(Homo sapiens (Human))
BDBM50016656
(5-(3,5-Dichloro-2-methanesulfonyl-phenyl)-imidazol...)
Show SMILES CS(=O)(=O)c1c(Cl)cc(Cl)cc1-c1[nH]c(=O)[nH]c1O
Show InChI InChI=1S/C10H8Cl2N2O4S/c1-19(17,18)8-5(2-4(11)3-6(8)12)7-9(15)14-10(16)13-7/h2-3,15H,1H3,(H2,13,14,16)
n/an/a 610n/an/an/an/an/an/a
Pfizer Inc.
Curated by ChEMBL
Assay Description
Inhibition of human placental aldose reductase (HPAR) activity with glyceraldehyde as substrate
J Med Chem 32: 1208-13 (1989)
BindingDB Entry DOI: 10.7270/Q24B309G