BDBM50016662 2-{4-[3-(2-Amino-4-oxo-3,4,7,8-tetrahydro-pteridin-6-yl)-2-methyl-propyl]-benzoylamino}-pentanedioic acid::CHEMBL23278
SMILES: CC(CC1=Nc2c(NC1)nc(N)[nH]c2=O)Cc1ccc(cc1)C(=O)NC(CCC(O)=O)C(O)=O
InChI Key: InChIKey=BLLHPJWVVWYMOU-UHFFFAOYSA-N
Data: 1 IC50
Activity Spreadsheet -- Enzyme Inhibition Constant Data from BindingDB
Found 1 hit for monomerid = 50016662
Trg + Lig
Ki
nM
ΔG°
kcal/mole
IC50
nM
Kd
nM
EC50/IC50
nM
koff
s-1
kon
M-1s-1
pHTemp
°C
Glycinamide ribonucleotide formyltransferase (GARFTase)
(Homo sapiens (Human))
BDBM50016662
(2-{4-[3-(2-Amino-4-oxo-3,4,7,8-tetrahydro-pteridin...)
Show SMILES CC(CC1=Nc2c(NC1)nc(N)[nH]c2=O)Cc1ccc(cc1)C(=O)NC(CCC(O)=O)C(O)=O |t:3|
Show InChI InChI=1S/C22H26N6O6/c1-11(9-14-10-24-18-17(25-14)20(32)28-22(23)27-18)8-12-2-4-13(5-3-12)19(31)26-15(21(33)34)6-7-16(29)30/h2-5,11,15H,6-10H2,1H3,(H,26,31)(H,29,30)(H,33,34)(H4,23,24,27,28,32)
n/an/a 550n/an/an/an/an/an/a
University of South Alabama
Curated by ChEMBL
Assay Description
Inhibition of the GAR transformylase in lactobacillus casei
J Med Chem 32: 1277-83 (1989)
BindingDB Entry DOI: 10.7270/Q20K27J9