BDBM50016710 1-{1-[2-(2-Acetylamino-3-hydroxy-propionylamino)-3-hydroxy-butyryl]-pyrrolidine-2-carbonyl}-pyrrolidine-2-carboxylic acid::CHEMBL309273
SMILES: C[C@@H](O)[C@H](NC(=O)[C@H](CO)NC(C)=O)C(=O)N1CCC[C@@H]1C(=O)N1CCC[C@H]1C(O)=O
InChI Key: InChIKey=YVQYBHMPFVHZNU-HUGQBSPZSA-N
Data: 1 IC50
Activity Spreadsheet -- Enzyme Inhibition Constant Data from BindingDB
Found 1 hit for monomerid = 50016710
Trg + Lig
Ki
nM
ΔG°
kcal/mole
IC50
nM
Kd
nM
EC50/IC50
nM
koff
s-1
kon
M-1s-1
pHTemp
°C
IgA protease
(Neisseria gonorrhoeae)
BDBM50016710
(1-{1-[2-(2-Acetylamino-3-hydroxy-propionylamino)-3...)
Show SMILES C[C@@H](O)[C@H](NC(=O)[C@H](CO)NC(C)=O)C(=O)N1CCC[C@@H]1C(=O)N1CCC[C@H]1C(O)=O
Show InChI InChI=1S/C19H30N4O8/c1-10(25)15(21-16(27)12(9-24)20-11(2)26)18(29)22-7-3-5-13(22)17(28)23-8-4-6-14(23)19(30)31/h10,12-15,24-25H,3-9H2,1-2H3,(H,20,26)(H,21,27)(H,30,31)/t10-,12+,13-,14+,15+/m1/s1
n/an/a 9.70E+3n/an/an/an/an/an/a
University Hospital
Curated by ChEMBL
Assay Description
Inhibitory concentration against type 1 IgA1 proteinases secreted by Neisseria gonorrhoeae
J Med Chem 32: 2407-11 (1989)
BindingDB Entry DOI: 10.7270/Q2R210B0