BDBM50016947 CHEMBL3286738
SMILES: Cn1cnc(c1)-c1ccc(N)c(NC(=O)c2ccc(nc2)N2CCC3(CNC(=O)O3)CC2)c1
InChI Key: InChIKey=DSWYPLARVKNCBB-UHFFFAOYSA-N
Data: 1 KI  1 IC50
Activity Spreadsheet -- Enzyme Inhibition Constant Data from BindingDB
Found 2 hits for monomerid = 50016947
Trg + Lig
Ki
nM
ΔG°
kcal/mole
IC50
nM
Kd
nM
EC50/IC50
nM
koff
s-1
kon
M-1s-1
pHTemp
°C
Potassium voltage-gated channel subfamily H member 2
(Homo sapiens (Human))
BDBM50016947
(CHEMBL3286738)
Show SMILES Cn1cnc(c1)-c1ccc(N)c(NC(=O)c2ccc(nc2)N2CCC3(CNC(=O)O3)CC2)c1
Show InChI InChI=1S/C23H25N7O3/c1-29-12-19(27-14-29)15-2-4-17(24)18(10-15)28-21(31)16-3-5-20(25-11-16)30-8-6-23(7-9-30)13-26-22(32)33-23/h2-5,10-12,14H,6-9,13,24H2,1H3,(H,26,32)(H,28,31)
Reactome pathway
>1.00E+4n/an/an/an/an/an/an/an/a
Merck Research Laboratories
Curated by ChEMBL
Assay Description
Binding affinity to human ERG
ACS Med Chem Lett 5: 340-5 (2014)
Article DOI: 10.1021/ml4004233
BindingDB Entry DOI: 10.7270/Q2HH6MM7
Histone deacetylase 1
(Homo sapiens (Human))
BDBM50016947
(CHEMBL3286738)
Show SMILES Cn1cnc(c1)-c1ccc(N)c(NC(=O)c2ccc(nc2)N2CCC3(CNC(=O)O3)CC2)c1
Show InChI InChI=1S/C23H25N7O3/c1-29-12-19(27-14-29)15-2-4-17(24)18(10-15)28-21(31)16-3-5-20(25-11-16)30-8-6-23(7-9-30)13-26-22(32)33-23/h2-5,10-12,14H,6-9,13,24H2,1H3,(H,26,32)(H,28,31)
NCI pathway
Reactome pathway
n/an/a 51n/an/an/an/an/an/a
Merck Research Laboratories
Curated by ChEMBL
Assay Description
Inhibition of FLAG-tagged full-length human recombinant HDAC1 expressed in HEK293F cells using acetyl-lysine containing peptide as substrate preincub...
ACS Med Chem Lett 5: 340-5 (2014)
Article DOI: 10.1021/ml4004233
BindingDB Entry DOI: 10.7270/Q2HH6MM7