BDBM50016958 1-(4-Fluoro-phenyl)-4-(4-thieno[3,2-c]pyridin-4-yl-piperazin-1-yl)-butan-1-ol::CHEMBL15560
SMILES: OC(CCCN1CCN(CC1)c1nccc2sccc12)c1ccc(F)cc1
InChI Key: InChIKey=YZSXHWKLZRAMBW-UHFFFAOYSA-N
Data: 4 IC50
Activity Spreadsheet -- Enzyme Inhibition Constant Data from BindingDB
Found 4 hits for monomerid = 50016958
Trg + Lig
Ki
nM
ΔG°
kcal/mole
IC50
nM
Kd
nM
EC50/IC50
nM
koff
s-1
kon
M-1s-1
pHTemp
°C
Serotonin 1 (5-HT1) receptor
(RAT-Rattus norvegicus (rat)-Rattus norvegicus (Rat...)
BDBM50016958
(1-(4-Fluoro-phenyl)-4-(4-thieno[3,2-c]pyridin-4-yl...)
Show SMILES OC(CCCN1CCN(CC1)c1nccc2sccc12)c1ccc(F)cc1
Show InChI InChI=1S/C21H24FN3OS/c22-17-5-3-16(4-6-17)19(26)2-1-10-24-11-13-25(14-12-24)21-18-8-15-27-20(18)7-9-23-21/h3-9,15,19,26H,1-2,10-14H2
n/an/a 3.80n/an/an/an/an/an/a
Bristol-Myers Company
Curated by ChEMBL
Assay Description
Ability to bind at 5-hydroxytryptamine 1 receptor of rat hippocampus by displacing [3H]5-HT
J Med Chem 32: 1147-56 (1989)
BindingDB Entry DOI: 10.7270/Q2HD7W8D
D(2) dopamine receptor
(Rattus norvegicus (rat))
BDBM50016958
(1-(4-Fluoro-phenyl)-4-(4-thieno[3,2-c]pyridin-4-yl...)
Show SMILES OC(CCCN1CCN(CC1)c1nccc2sccc12)c1ccc(F)cc1
Show InChI InChI=1S/C21H24FN3OS/c22-17-5-3-16(4-6-17)19(26)2-1-10-24-11-13-25(14-12-24)21-18-8-15-27-20(18)7-9-23-21/h3-9,15,19,26H,1-2,10-14H2
Reactome pathway
n/an/a 72n/an/an/an/an/an/a
Bristol-Myers Company
Curated by ChEMBL
Assay Description
Ability to bind at Dopamine receptor D2 of rat corpus striatum by displacing [3H]spiperone
J Med Chem 32: 1147-56 (1989)
BindingDB Entry DOI: 10.7270/Q2HD7W8D
Serotonin 2 (5-HT2) receptor
(Rattus norvegicus (rat)-RAT-Rattus norvegicus (Rat...)
BDBM50016958
(1-(4-Fluoro-phenyl)-4-(4-thieno[3,2-c]pyridin-4-yl...)
Show SMILES OC(CCCN1CCN(CC1)c1nccc2sccc12)c1ccc(F)cc1
Show InChI InChI=1S/C21H24FN3OS/c22-17-5-3-16(4-6-17)19(26)2-1-10-24-11-13-25(14-12-24)21-18-8-15-27-20(18)7-9-23-21/h3-9,15,19,26H,1-2,10-14H2
n/an/a 5.80n/an/an/an/an/an/a
Bristol-Myers Company
Curated by ChEMBL
Assay Description
Ability to bind at serotonin 5-hydroxytryptamine 2 receptors of rat hippocampus by displacing [3H]spiperone
J Med Chem 32: 1147-56 (1989)
BindingDB Entry DOI: 10.7270/Q2HD7W8D
Alpha-1 Adrenergic Receptor/ adrenergic receptor/ adrenergic receptor
(Rattus norvegicus (rat)-Rattus norvegicus (Rat))
BDBM50016958
(1-(4-Fluoro-phenyl)-4-(4-thieno[3,2-c]pyridin-4-yl...)
Show SMILES OC(CCCN1CCN(CC1)c1nccc2sccc12)c1ccc(F)cc1
Show InChI InChI=1S/C21H24FN3OS/c22-17-5-3-16(4-6-17)19(26)2-1-10-24-11-13-25(14-12-24)21-18-8-15-27-20(18)7-9-23-21/h3-9,15,19,26H,1-2,10-14H2
Reactome pathway
n/an/a 23n/an/an/an/an/an/a
Bristol-Myers Company
Curated by ChEMBL
Assay Description
Ability to bind at alpha-1 adrenergic receptor by displacing [3H]WB-4101
J Med Chem 32: 1147-56 (1989)
BindingDB Entry DOI: 10.7270/Q2HD7W8D