BDBM50017083 CHEMBL3287049::US9428504, 39
SMILES: CC(C)(C)CN1CCC2(CN(c3c2c(Cl)ccc3O)c2ccccc2NC(=O)Nc2nc3ccc(F)cc3s2)CC1
InChI Key: InChIKey=ACVSRSHOAKOROK-UHFFFAOYSA-N
Data: 1 KI  1 IC50
Activity Spreadsheet -- Enzyme Inhibition Constant Data from BindingDB
Found 2 hits for monomerid = 50017083
Trg + Lig
Ki
nM
ΔG°
kcal/mole
IC50
nM
Kd
nM
EC50/IC50
nM
koff
s-1
kon
M-1s-1
pHTemp
°C
Purinergic receptor P2Y1
(Homo sapiens (Human))
BDBM50017083
(CHEMBL3287049 | US9428504, 39)
Show SMILES CC(C)(C)CN1CCC2(CN(c3c2c(Cl)ccc3O)c2ccccc2NC(=O)Nc2nc3ccc(F)cc3s2)CC1
Show InChI InChI=1S/C31H33ClFN5O2S/c1-30(2,3)17-37-14-12-31(13-15-37)18-38(27-24(39)11-9-20(32)26(27)31)23-7-5-4-6-21(23)34-28(40)36-29-35-22-10-8-19(33)16-25(22)41-29/h4-11,16,39H,12-15,17-18H2,1-3H3,(H2,34,35,36,40)
US Patent
3.80 -11.5n/an/an/an/an/a7.425
Bristol-Myers Squibb Company
US Patent
Assay Description
A SPA membrane binding assay was used to identify inhibitors of [33P] 2MeS-ADP binding to cloned human P2Y1 receptors (The P2Y1 receptor membranes we...
US Patent US9428504 (2016)
BindingDB Entry DOI: 10.7270/Q24748SD
Purinergic receptor P2Y1
(Homo sapiens (Human))
BDBM50017083
(CHEMBL3287049 | US9428504, 39)
Show SMILES CC(C)(C)CN1CCC2(CN(c3c2c(Cl)ccc3O)c2ccccc2NC(=O)Nc2nc3ccc(F)cc3s2)CC1
Show InChI InChI=1S/C31H33ClFN5O2S/c1-30(2,3)17-37-14-12-31(13-15-37)18-38(27-24(39)11-9-20(32)26(27)31)23-7-5-4-6-21(23)34-28(40)36-29-35-22-10-8-19(33)16-25(22)41-29/h4-11,16,39H,12-15,17-18H2,1-3H3,(H2,34,35,36,40)
n/an/a 0.0600n/an/an/an/an/an/a
Bristol-Myers Squibb
Curated by ChEMBL
Assay Description
Antagonist activity at P2Y1 receptor in human platelets by FLIPR assay in presence of 2-methylthio-ADP
Bioorg Med Chem Lett 24: 1294-8 (2014)
Article DOI: 10.1016/j.bmcl.2014.01.066
BindingDB Entry DOI: 10.7270/Q20G3MQF