BDBM50017135 CHEMBL3287328
SMILES: CC(=O)N[C@@H](CCCNC(N)=N)C(=O)N[C@H](Cc1ccc(Cl)cc1)C(=O)N1Cc2ccccc2CC1C(=O)N[C@H](Cc1ccc(cc1)[N+]([O-])=O)C(N)=O
InChI Key: InChIKey=VUNSGMTWWHNMCR-LVCGBWMPSA-N
Data: 5 EC50
Activity Spreadsheet -- Enzyme Inhibition Constant Data from BindingDB
Found 5 hits for monomerid = 50017135
Trg + Lig
Ki
nM
ΔG°
kcal/mole
IC50
nM
Kd
nM
EC50/IC50
nM
koff
s-1
kon
M-1s-1
pHTemp
°C
Melanocortin receptor 4
(Homo sapiens (Human))
BDBM50017135
(CHEMBL3287328)
Show SMILES CC(=O)N[C@@H](CCCNC(N)=N)C(=O)N[C@H](Cc1ccc(Cl)cc1)C(=O)N1Cc2ccccc2CC1C(=O)N[C@H](Cc1ccc(cc1)[N+]([O-])=O)C(N)=O |r|
Show InChI InChI=1S/C36H42ClN9O7/c1-21(47)42-28(7-4-16-41-36(39)40)33(49)44-30(18-22-8-12-26(37)13-9-22)35(51)45-20-25-6-3-2-5-24(25)19-31(45)34(50)43-29(32(38)48)17-23-10-14-27(15-11-23)46(52)53/h2-3,5-6,8-15,28-31H,4,7,16-20H2,1H3,(H2,38,48)(H,42,47)(H,43,50)(H,44,49)(H4,39,40,41)/t28-,29+,30+,31?/m0/s1
n/an/an/an/a 0.210n/an/an/an/a
University of Florida
Curated by ChEMBL
Assay Description
Agonist activity at wild type human melanocortin-4 receptor expressed in HEK293 cells co-transfected with CRE/beta-galactosidase reporter gene assess...
J Med Chem 57: 4615-28 (2014)
Article DOI: 10.1021/jm500064t
BindingDB Entry DOI: 10.7270/Q2VQ347J
Melanocortin receptor 1
(Mus musculus)
BDBM50017135
(CHEMBL3287328)
Show SMILES CC(=O)N[C@@H](CCCNC(N)=N)C(=O)N[C@H](Cc1ccc(Cl)cc1)C(=O)N1Cc2ccccc2CC1C(=O)N[C@H](Cc1ccc(cc1)[N+]([O-])=O)C(N)=O |r|
Show InChI InChI=1S/C36H42ClN9O7/c1-21(47)42-28(7-4-16-41-36(39)40)33(49)44-30(18-22-8-12-26(37)13-9-22)35(51)45-20-25-6-3-2-5-24(25)19-31(45)34(50)43-29(32(38)48)17-23-10-14-27(15-11-23)46(52)53/h2-3,5-6,8-15,28-31H,4,7,16-20H2,1H3,(H2,38,48)(H,42,47)(H,43,50)(H,44,49)(H4,39,40,41)/t28-,29+,30+,31?/m0/s1
n/an/an/an/a 22n/an/an/an/a
University of Florida
Curated by ChEMBL
Assay Description
Agonist activity at mouse melanocortin-1 receptor expressed in HEK293 cells co-transfected with CRE/beta-galactosidase reporter gene assessed as stim...
J Med Chem 57: 4615-28 (2014)
Article DOI: 10.1021/jm500064t
BindingDB Entry DOI: 10.7270/Q2VQ347J
Melanocortin receptor 5 (MC5R)
(Mus musculus (Mouse))
BDBM50017135
(CHEMBL3287328)
Show SMILES CC(=O)N[C@@H](CCCNC(N)=N)C(=O)N[C@H](Cc1ccc(Cl)cc1)C(=O)N1Cc2ccccc2CC1C(=O)N[C@H](Cc1ccc(cc1)[N+]([O-])=O)C(N)=O |r|
Show InChI InChI=1S/C36H42ClN9O7/c1-21(47)42-28(7-4-16-41-36(39)40)33(49)44-30(18-22-8-12-26(37)13-9-22)35(51)45-20-25-6-3-2-5-24(25)19-31(45)34(50)43-29(32(38)48)17-23-10-14-27(15-11-23)46(52)53/h2-3,5-6,8-15,28-31H,4,7,16-20H2,1H3,(H2,38,48)(H,42,47)(H,43,50)(H,44,49)(H4,39,40,41)/t28-,29+,30+,31?/m0/s1
n/an/an/an/a 1n/an/an/an/a
University of Florida
Curated by ChEMBL
Assay Description
Agonist activity at mouse melanocortin-5 receptor expressed in HEK293 cells co-transfected with CRE/beta-galactosidase reporter gene assessed as stim...
J Med Chem 57: 4615-28 (2014)
Article DOI: 10.1021/jm500064t
BindingDB Entry DOI: 10.7270/Q2VQ347J
Melanocortin receptor 4
(Mus musculus)
BDBM50017135
(CHEMBL3287328)
Show SMILES CC(=O)N[C@@H](CCCNC(N)=N)C(=O)N[C@H](Cc1ccc(Cl)cc1)C(=O)N1Cc2ccccc2CC1C(=O)N[C@H](Cc1ccc(cc1)[N+]([O-])=O)C(N)=O |r|
Show InChI InChI=1S/C36H42ClN9O7/c1-21(47)42-28(7-4-16-41-36(39)40)33(49)44-30(18-22-8-12-26(37)13-9-22)35(51)45-20-25-6-3-2-5-24(25)19-31(45)34(50)43-29(32(38)48)17-23-10-14-27(15-11-23)46(52)53/h2-3,5-6,8-15,28-31H,4,7,16-20H2,1H3,(H2,38,48)(H,42,47)(H,43,50)(H,44,49)(H4,39,40,41)/t28-,29+,30+,31?/m0/s1
n/an/an/an/a 7.60n/an/an/an/a
University of Florida
Curated by ChEMBL
Assay Description
Agonist activity at mouse melanocortin-4 receptor expressed in HEK293 cells co-transfected with CRE/beta-galactosidase reporter gene assessed as stim...
J Med Chem 57: 4615-28 (2014)
Article DOI: 10.1021/jm500064t
BindingDB Entry DOI: 10.7270/Q2VQ347J
Melanocortin receptor 3
(Mus musculus)
BDBM50017135
(CHEMBL3287328)
Show SMILES CC(=O)N[C@@H](CCCNC(N)=N)C(=O)N[C@H](Cc1ccc(Cl)cc1)C(=O)N1Cc2ccccc2CC1C(=O)N[C@H](Cc1ccc(cc1)[N+]([O-])=O)C(N)=O |r|
Show InChI InChI=1S/C36H42ClN9O7/c1-21(47)42-28(7-4-16-41-36(39)40)33(49)44-30(18-22-8-12-26(37)13-9-22)35(51)45-20-25-6-3-2-5-24(25)19-31(45)34(50)43-29(32(38)48)17-23-10-14-27(15-11-23)46(52)53/h2-3,5-6,8-15,28-31H,4,7,16-20H2,1H3,(H2,38,48)(H,42,47)(H,43,50)(H,44,49)(H4,39,40,41)/t28-,29+,30+,31?/m0/s1
Reactome pathway
n/an/an/an/a 94n/an/an/an/a
University of Florida
Curated by ChEMBL
Assay Description
Agonist activity at mouse melanocortin-3 receptor expressed in HEK293 cells co-transfected with CRE/beta-galactosidase reporter gene assessed as stim...
J Med Chem 57: 4615-28 (2014)
Article DOI: 10.1021/jm500064t
BindingDB Entry DOI: 10.7270/Q2VQ347J