BDBM50017256 CHEMBL3287698::US10099993, Compound 47
SMILES: Cc1c(O)c(ccc1OCCCCOc1ccc(cc1Cl)C(O)=O)C(=O)CC1CCCC1
InChI Key: InChIKey=XIWVJTYJVVEJHE-UHFFFAOYSA-N
Data: 4 EC50
Activity Spreadsheet -- Enzyme Inhibition Constant Data from BindingDB
Found 4 hits for monomerid = 50017256
Trg + Lig
Ki
nM
ΔG°
kcal/mole
IC50
nM
Kd
nM
EC50/IC50
nM
koff
s-1
kon
M-1s-1
pHTemp
°C
Metabotropic glutamate receptor 3
(Rattus norvegicus (Rat))
BDBM50017256
(CHEMBL3287698 | US10099993, Compound 47)
Show SMILES Cc1c(O)c(ccc1OCCCCOc1ccc(cc1Cl)C(O)=O)C(=O)CC1CCCC1
Show InChI InChI=1S/C25H29ClO6/c1-16-22(11-9-19(24(16)28)21(27)14-17-6-2-3-7-17)31-12-4-5-13-32-23-10-8-18(25(29)30)15-20(23)26/h8-11,15,17,28H,2-7,12-14H2,1H3,(H,29,30)
n/an/an/an/a>1.00E+4n/an/an/an/a
Sanford-Burnham Medical Research Institute
Curated by ChEMBL
Assay Description
Positive allosteric modulation of rat mGluR3 receptor expressed in HEK293 cells assessed as potentiation of glutamate-induced thallium flux incubated...
J Med Chem 57: 4154-72 (2014)
Article DOI: 10.1021/jm5000563
BindingDB Entry DOI: 10.7270/Q2GH9KH9
Metabotropic glutamate receptor 3
(Homo sapiens (Human))
BDBM50017256
(CHEMBL3287698 | US10099993, Compound 47)
Show SMILES Cc1c(O)c(ccc1OCCCCOc1ccc(cc1Cl)C(O)=O)C(=O)CC1CCCC1
Show InChI InChI=1S/C25H29ClO6/c1-16-22(11-9-19(24(16)28)21(27)14-17-6-2-3-7-17)31-12-4-5-13-32-23-10-8-18(25(29)30)15-20(23)26/h8-11,15,17,28H,2-7,12-14H2,1H3,(H,29,30)
US Patent
n/an/an/an/a>1.00E+4n/an/an/an/a
SANFORD-BURNHAM MEDICAL RESEARCH INSTITUTE
US Patent
US Patent US10099993 (2018)
BindingDB Entry DOI: 10.7270/Q2Z89FFP
Metabotropic glutamate receptor 2
(Homo sapiens (Human))
BDBM50017256
(CHEMBL3287698 | US10099993, Compound 47)
Show SMILES Cc1c(O)c(ccc1OCCCCOc1ccc(cc1Cl)C(O)=O)C(=O)CC1CCCC1
Show InChI InChI=1S/C25H29ClO6/c1-16-22(11-9-19(24(16)28)21(27)14-17-6-2-3-7-17)31-12-4-5-13-32-23-10-8-18(25(29)30)15-20(23)26/h8-11,15,17,28H,2-7,12-14H2,1H3,(H,29,30)
US Patent
n/an/an/an/a 237n/an/a7.325
SANFORD-BURNHAM MEDICAL RESEARCH INSTITUTE
US Patent
Assay Description
Human Embryonic Kidney (HEK-293) cell lines co-expressing rat mGlu receptors 2, 3, 4, 6, 7 or 8 and G protein-coupled inwardly-rectifying potassium (...
US Patent US10099993 (2018)
BindingDB Entry DOI: 10.7270/Q2Z89FFP
Metabotropic glutamate receptor 2
(Homo sapiens (Human))
BDBM50017256
(CHEMBL3287698 | US10099993, Compound 47)
Show SMILES Cc1c(O)c(ccc1OCCCCOc1ccc(cc1Cl)C(O)=O)C(=O)CC1CCCC1
Show InChI InChI=1S/C25H29ClO6/c1-16-22(11-9-19(24(16)28)21(27)14-17-6-2-3-7-17)31-12-4-5-13-32-23-10-8-18(25(29)30)15-20(23)26/h8-11,15,17,28H,2-7,12-14H2,1H3,(H,29,30)
n/an/an/an/a 237n/an/an/an/a
Sanford-Burnham Medical Research Institute
Curated by ChEMBL
Assay Description
Positive allosteric modulation of rat mGluR2 receptor expressed in HEK293 cells assessed as potentiation of glutamate-induced thallium flux incubated...
J Med Chem 57: 4154-72 (2014)
Article DOI: 10.1021/jm5000563
BindingDB Entry DOI: 10.7270/Q2GH9KH9