BDBM50017260 CHEMBL3287702::US10099993, Compound 51
SMILES: COc1ccc(cc1OCCCCOc1ccc(C(=O)CC2CCCC2)c(O)c1C)C(O)=O
InChI Key: InChIKey=RTZLGAJHKLYQLG-UHFFFAOYSA-N
Data: 4 EC50
Activity Spreadsheet -- Enzyme Inhibition Constant Data from BindingDB
Found 4 hits for monomerid = 50017260
Trg + Lig
Ki
nM
ΔG°
kcal/mole
IC50
nM
Kd
nM
EC50/IC50
nM
koff
s-1
kon
M-1s-1
pHTemp
°C
Metabotropic glutamate receptor 3
(Rattus norvegicus (Rat))
BDBM50017260
(CHEMBL3287702 | US10099993, Compound 51)
Show SMILES COc1ccc(cc1OCCCCOc1ccc(C(=O)CC2CCCC2)c(O)c1C)C(O)=O
Show InChI InChI=1S/C26H32O7/c1-17-22(12-10-20(25(17)28)21(27)15-18-7-3-4-8-18)32-13-5-6-14-33-24-16-19(26(29)30)9-11-23(24)31-2/h9-12,16,18,28H,3-8,13-15H2,1-2H3,(H,29,30)
n/an/an/an/a 1.02E+3n/an/an/an/a
Sanford-Burnham Medical Research Institute
Curated by ChEMBL
Assay Description
Positive allosteric modulation of rat mGluR3 receptor expressed in HEK293 cells assessed as potentiation of glutamate-induced thallium flux incubated...
J Med Chem 57: 4154-72 (2014)
Article DOI: 10.1021/jm5000563
BindingDB Entry DOI: 10.7270/Q2GH9KH9
Metabotropic glutamate receptor 3
(Homo sapiens (Human))
BDBM50017260
(CHEMBL3287702 | US10099993, Compound 51)
Show SMILES COc1ccc(cc1OCCCCOc1ccc(C(=O)CC2CCCC2)c(O)c1C)C(O)=O
Show InChI InChI=1S/C26H32O7/c1-17-22(12-10-20(25(17)28)21(27)15-18-7-3-4-8-18)32-13-5-6-14-33-24-16-19(26(29)30)9-11-23(24)31-2/h9-12,16,18,28H,3-8,13-15H2,1-2H3,(H,29,30)
US Patent
n/an/an/an/a 1.02E+3n/an/an/an/a
SANFORD-BURNHAM MEDICAL RESEARCH INSTITUTE
US Patent
US Patent US10099993 (2018)
BindingDB Entry DOI: 10.7270/Q2Z89FFP
Metabotropic glutamate receptor 2
(Homo sapiens (Human))
BDBM50017260
(CHEMBL3287702 | US10099993, Compound 51)
Show SMILES COc1ccc(cc1OCCCCOc1ccc(C(=O)CC2CCCC2)c(O)c1C)C(O)=O
Show InChI InChI=1S/C26H32O7/c1-17-22(12-10-20(25(17)28)21(27)15-18-7-3-4-8-18)32-13-5-6-14-33-24-16-19(26(29)30)9-11-23(24)31-2/h9-12,16,18,28H,3-8,13-15H2,1-2H3,(H,29,30)
US Patent
n/an/an/an/a 425n/an/a7.325
SANFORD-BURNHAM MEDICAL RESEARCH INSTITUTE
US Patent
Assay Description
Human Embryonic Kidney (HEK-293) cell lines co-expressing rat mGlu receptors 2, 3, 4, 6, 7 or 8 and G protein-coupled inwardly-rectifying potassium (...
US Patent US10099993 (2018)
BindingDB Entry DOI: 10.7270/Q2Z89FFP
Metabotropic glutamate receptor 2
(Homo sapiens (Human))
BDBM50017260
(CHEMBL3287702 | US10099993, Compound 51)
Show SMILES COc1ccc(cc1OCCCCOc1ccc(C(=O)CC2CCCC2)c(O)c1C)C(O)=O
Show InChI InChI=1S/C26H32O7/c1-17-22(12-10-20(25(17)28)21(27)15-18-7-3-4-8-18)32-13-5-6-14-33-24-16-19(26(29)30)9-11-23(24)31-2/h9-12,16,18,28H,3-8,13-15H2,1-2H3,(H,29,30)
n/an/an/an/a 425n/an/an/an/a
Sanford-Burnham Medical Research Institute
Curated by ChEMBL
Assay Description
Positive allosteric modulation of rat mGluR2 receptor expressed in HEK293 cells assessed as potentiation of glutamate-induced thallium flux incubated...
J Med Chem 57: 4154-72 (2014)
Article DOI: 10.1021/jm5000563
BindingDB Entry DOI: 10.7270/Q2GH9KH9