BDBM50017276 CHEMBL3287679::US10099993, Compound 28
SMILES: CC(C)CC(=O)c1ccc(OCCCCOc2ccccc2C(O)=O)c(C)c1O
InChI Key: InChIKey=SEVOKEKAFIENJT-UHFFFAOYSA-N
Data: 3 EC50
Activity Spreadsheet -- Enzyme Inhibition Constant Data from BindingDB
Found 3 hits for monomerid = 50017276
Trg + Lig
Ki
nM
ΔG°
kcal/mole
IC50
nM
Kd
nM
EC50/IC50
nM
koff
s-1
kon
M-1s-1
pHTemp
°C
Metabotropic glutamate receptor 2
(Homo sapiens (Human))
BDBM50017276
(CHEMBL3287679 | US10099993, Compound 28)
Show SMILES CC(C)CC(=O)c1ccc(OCCCCOc2ccccc2C(O)=O)c(C)c1O
Show InChI InChI=1S/C23H28O6/c1-15(2)14-19(24)17-10-11-20(16(3)22(17)25)28-12-6-7-13-29-21-9-5-4-8-18(21)23(26)27/h4-5,8-11,15,25H,6-7,12-14H2,1-3H3,(H,26,27)
n/an/an/an/a 415n/an/an/an/a
Sanford-Burnham Medical Research Institute
Curated by ChEMBL
Assay Description
Positive allosteric modulation of rat mGluR2 receptor expressed in HEK293 cells assessed as potentiation of glutamate-induced thallium flux incubated...
J Med Chem 57: 4154-72 (2014)
Article DOI: 10.1021/jm5000563
BindingDB Entry DOI: 10.7270/Q2GH9KH9
Metabotropic glutamate receptor 3
(Homo sapiens (Human))
BDBM50017276
(CHEMBL3287679 | US10099993, Compound 28)
Show SMILES CC(C)CC(=O)c1ccc(OCCCCOc2ccccc2C(O)=O)c(C)c1O
Show InChI InChI=1S/C23H28O6/c1-15(2)14-19(24)17-10-11-20(16(3)22(17)25)28-12-6-7-13-29-21-9-5-4-8-18(21)23(26)27/h4-5,8-11,15,25H,6-7,12-14H2,1-3H3,(H,26,27)
US Patent
n/an/an/an/a>3.00E+4n/an/an/an/a
SANFORD-BURNHAM MEDICAL RESEARCH INSTITUTE
US Patent
US Patent US10099993 (2018)
BindingDB Entry DOI: 10.7270/Q2Z89FFP
Metabotropic glutamate receptor 2
(Homo sapiens (Human))
BDBM50017276
(CHEMBL3287679 | US10099993, Compound 28)
Show SMILES CC(C)CC(=O)c1ccc(OCCCCOc2ccccc2C(O)=O)c(C)c1O
Show InChI InChI=1S/C23H28O6/c1-15(2)14-19(24)17-10-11-20(16(3)22(17)25)28-12-6-7-13-29-21-9-5-4-8-18(21)23(26)27/h4-5,8-11,15,25H,6-7,12-14H2,1-3H3,(H,26,27)
US Patent
n/an/an/an/a 415n/an/a7.325
SANFORD-BURNHAM MEDICAL RESEARCH INSTITUTE
US Patent
Assay Description
Human Embryonic Kidney (HEK-293) cell lines co-expressing rat mGlu receptors 2, 3, 4, 6, 7 or 8 and G protein-coupled inwardly-rectifying potassium (...
US Patent US10099993 (2018)
BindingDB Entry DOI: 10.7270/Q2Z89FFP