BDBM50017287 CHEMBL3287712::US10099993, Compound 61
SMILES: CCC(=O)c1ccc(OCCCCOc2ccc(cc2C)C(O)=O)c(C)c1O
InChI Key: InChIKey=MYVWUBMGTKFSLD-UHFFFAOYSA-N
Data: 3 EC50
Activity Spreadsheet -- Enzyme Inhibition Constant Data from BindingDB
Found 3 hits for monomerid = 50017287
Trg + Lig
Ki
nM
ΔG°
kcal/mole
IC50
nM
Kd
nM
EC50/IC50
nM
koff
s-1
kon
M-1s-1
pHTemp
°C
Metabotropic glutamate receptor 2
(Homo sapiens (Human))
BDBM50017287
(CHEMBL3287712 | US10099993, Compound 61)
Show SMILES CCC(=O)c1ccc(OCCCCOc2ccc(cc2C)C(O)=O)c(C)c1O
Show InChI InChI=1S/C22H26O6/c1-4-18(23)17-8-10-20(15(3)21(17)24)28-12-6-5-11-27-19-9-7-16(22(25)26)13-14(19)2/h7-10,13,24H,4-6,11-12H2,1-3H3,(H,25,26)
n/an/an/an/a 82n/an/an/an/a
Sanford-Burnham Medical Research Institute
Curated by ChEMBL
Assay Description
Positive allosteric modulation of rat mGluR2 receptor expressed in HEK293 cells assessed as potentiation of glutamate-induced thallium flux incubated...
J Med Chem 57: 4154-72 (2014)
Article DOI: 10.1021/jm5000563
BindingDB Entry DOI: 10.7270/Q2GH9KH9
Metabotropic glutamate receptor 3
(Homo sapiens (Human))
BDBM50017287
(CHEMBL3287712 | US10099993, Compound 61)
Show SMILES CCC(=O)c1ccc(OCCCCOc2ccc(cc2C)C(O)=O)c(C)c1O
Show InChI InChI=1S/C22H26O6/c1-4-18(23)17-8-10-20(15(3)21(17)24)28-12-6-5-11-27-19-9-7-16(22(25)26)13-14(19)2/h7-10,13,24H,4-6,11-12H2,1-3H3,(H,25,26)
US Patent
n/an/an/an/a>3.00E+4n/an/an/an/a
SANFORD-BURNHAM MEDICAL RESEARCH INSTITUTE
US Patent
US Patent US10099993 (2018)
BindingDB Entry DOI: 10.7270/Q2Z89FFP
Metabotropic glutamate receptor 2
(Homo sapiens (Human))
BDBM50017287
(CHEMBL3287712 | US10099993, Compound 61)
Show SMILES CCC(=O)c1ccc(OCCCCOc2ccc(cc2C)C(O)=O)c(C)c1O
Show InChI InChI=1S/C22H26O6/c1-4-18(23)17-8-10-20(15(3)21(17)24)28-12-6-5-11-27-19-9-7-16(22(25)26)13-14(19)2/h7-10,13,24H,4-6,11-12H2,1-3H3,(H,25,26)
US Patent
n/an/an/an/a 82n/an/a7.325
SANFORD-BURNHAM MEDICAL RESEARCH INSTITUTE
US Patent
Assay Description
Human Embryonic Kidney (HEK-293) cell lines co-expressing rat mGlu receptors 2, 3, 4, 6, 7 or 8 and G protein-coupled inwardly-rectifying potassium (...
US Patent US10099993 (2018)
BindingDB Entry DOI: 10.7270/Q2Z89FFP