BDBM50017352 CHEMBL3288270
SMILES: CC(=O)Nc1ccc2C(C(=O)NCc3ccc(F)cc3)C(=O)N(O)C(=O)c2c1
InChI Key: InChIKey=IZFVBHHOUWMJID-UHFFFAOYSA-N
Data: 1 IC50
Activity Spreadsheet -- Enzyme Inhibition Constant Data from BindingDB
Found 1 hit for monomerid = 50017352
Trg + Lig
Ki
nM
ΔG°
kcal/mole
IC50
nM
Kd
nM
EC50/IC50
nM
koff
s-1
kon
M-1s-1
pHTemp
°C
Human immunodeficiency virus type 1 integrase
(Human immunodeficiency virus 1)
BDBM50017352
(CHEMBL3288270)
Show SMILES CC(=O)Nc1ccc2C(C(=O)NCc3ccc(F)cc3)C(=O)N(O)C(=O)c2c1
Show InChI InChI=1S/C19H16FN3O5/c1-10(24)22-13-6-7-14-15(8-13)18(26)23(28)19(27)16(14)17(25)21-9-11-2-4-12(20)5-3-11/h2-8,16,28H,9H2,1H3,(H,21,25)(H,22,24)
n/an/a 100n/an/an/an/an/an/a
Universit£ Lille Nord de France
Curated by ChEMBL
Assay Description
Inhibition of HIV-1 overall integrase activity using 5'-digoxigenin-labeled GACCCTTTTAGTCAGTGTGGAAAATCTCTAGCAGT-3' as substrate after 1 hr by ELISA
J Med Chem 57: 4640-60 (2014)
Article DOI: 10.1021/jm500109z
BindingDB Entry DOI: 10.7270/Q2TQ6335