BDBM50017353 CHEMBL3288271
SMILES: ON1C(=O)C(C(=O)NCc2ccc(F)cc2)c2ccc(NC(=O)c3ccccc3)cc2C1=O
InChI Key: InChIKey=OMSNIRXSLGYCPH-UHFFFAOYSA-N
Data: 1 IC50
Activity Spreadsheet -- Enzyme Inhibition Constant Data from BindingDB
Found 1 hit for monomerid = 50017353
Trg + Lig
Ki
nM
ΔG°
kcal/mole
IC50
nM
Kd
nM
EC50/IC50
nM
koff
s-1
kon
M-1s-1
pHTemp
°C
Human immunodeficiency virus type 1 integrase
(Human immunodeficiency virus 1)
BDBM50017353
(CHEMBL3288271)
Show SMILES ON1C(=O)C(C(=O)NCc2ccc(F)cc2)c2ccc(NC(=O)c3ccccc3)cc2C1=O
Show InChI InChI=1S/C24H18FN3O5/c25-16-8-6-14(7-9-16)13-26-22(30)20-18-11-10-17(12-19(18)23(31)28(33)24(20)32)27-21(29)15-4-2-1-3-5-15/h1-12,20,33H,13H2,(H,26,30)(H,27,29)
n/an/a 80n/an/an/an/an/an/a
Universit£ Lille Nord de France
Curated by ChEMBL
Assay Description
Inhibition of HIV-1 overall integrase activity using 5'-digoxigenin-labeled GACCCTTTTAGTCAGTGTGGAAAATCTCTAGCAGT-3' as substrate after 1 hr by ELISA
J Med Chem 57: 4640-60 (2014)
Article DOI: 10.1021/jm500109z
BindingDB Entry DOI: 10.7270/Q2TQ6335