null
SMILES: CCN(CC)CC1CCCN1CC(=O)N1c2ccccc2C(=O)Nc2cccnc12
InChI Key: InChIKey=DSXLEGJNZCFXQE-UHFFFAOYSA-N
Activity Spreadsheet -- Enzyme Inhibition Constant Data from BindingDB
Found 4 hits for monomerid = 50018299
Trg + Lig
Ki
nM
ΔG°
kcal/mole
IC50
nM
Kd
nM
EC50/IC50
nM
koff
s-1
kon
M-1s-1
pHTemp
°C
Muscarinic acetylcholine receptor M2
(RAT)
BDBM50018299
(11-[2-(2-Diethylaminomethyl-pyrrolidin-1-yl)-acety...)
Show SMILES CCN(CC)CC1CCCN1CC(=O)N1c2ccccc2C(=O)Nc2cccnc12
Show InChI InChI=1S/C23H29N5O2/c1-3-26(4-2)15-17-9-8-14-27(17)16-21(29)28-20-12-6-5-10-18(20)23(30)25-19-11-7-13-24-22(19)28/h5-7,10-13,17H,3-4,8-9,14-16H2,1-2H3,(H,25,30)
Reactome pathway
n/an/a 150n/an/an/an/an/an/a
Dr. Karl Thomae GmbH
Curated by ChEMBL
Assay Description
Binding affinity to the rat cardiac muscarinic acetylcholine receptor M2 using 0.3 nM [3H]-N-methylscopolamine as radioligand
J Med Chem 32: 1718-24 (1989)
BindingDB Entry DOI: 10.7270/Q2XG9Q4Q
Muscarinic acetylcholine receptor M2
(RAT)
BDBM50018299
(11-[2-(2-Diethylaminomethyl-pyrrolidin-1-yl)-acety...)
Show SMILES CCN(CC)CC1CCCN1CC(=O)N1c2ccccc2C(=O)Nc2cccnc12
Show InChI InChI=1S/C23H29N5O2/c1-3-26(4-2)15-17-9-8-14-27(17)16-21(29)28-20-12-6-5-10-18(20)23(30)25-19-11-7-13-24-22(19)28/h5-7,10-13,17H,3-4,8-9,14-16H2,1-2H3,(H,25,30)
Reactome pathway
n/an/a 150n/an/an/an/an/an/a
College of Pharmacy
Curated by ChEMBL
Assay Description
Inhibition of muscarinic (M2) receptor isolated from rat atria
J Med Chem 37: 3775-88 (1994)
BindingDB Entry DOI: 10.7270/Q2QC02JX
Muscarinic acetylcholine receptor M3
(RAT)
BDBM50018299
(11-[2-(2-Diethylaminomethyl-pyrrolidin-1-yl)-acety...)
Show SMILES CCN(CC)CC1CCCN1CC(=O)N1c2ccccc2C(=O)Nc2cccnc12
Show InChI InChI=1S/C23H29N5O2/c1-3-26(4-2)15-17-9-8-14-27(17)16-21(29)28-20-12-6-5-10-18(20)23(30)25-19-11-7-13-24-22(19)28/h5-7,10-13,17H,3-4,8-9,14-16H2,1-2H3,(H,25,30)
Reactome pathway
n/an/a 2.00E+3n/an/an/an/an/an/a
College of Pharmacy
Curated by ChEMBL
Assay Description
Inhibition of rat submandibular muscarinic (M3) receptor isolated from tissue homogenates
J Med Chem 37: 3775-88 (1994)
BindingDB Entry DOI: 10.7270/Q2QC02JX
Muscarinic acetylcholine receptor M3
(RAT)
BDBM50018299
(11-[2-(2-Diethylaminomethyl-pyrrolidin-1-yl)-acety...)
Show SMILES CCN(CC)CC1CCCN1CC(=O)N1c2ccccc2C(=O)Nc2cccnc12
Show InChI InChI=1S/C23H29N5O2/c1-3-26(4-2)15-17-9-8-14-27(17)16-21(29)28-20-12-6-5-10-18(20)23(30)25-19-11-7-13-24-22(19)28/h5-7,10-13,17H,3-4,8-9,14-16H2,1-2H3,(H,25,30)
Reactome pathway
n/an/a 2.00E+3n/an/an/an/an/an/a
Dr. Karl Thomae GmbH
Curated by ChEMBL
Assay Description
Binding affinity for glandular muscarinic acetylcholine receptor M3 in rat assayed using 0.3 nM [3H]-N-methylscopolamine as radioligand
J Med Chem 32: 1718-24 (1989)
BindingDB Entry DOI: 10.7270/Q2XG9Q4Q