null
SMILES: [#6]-[#6]-[#6@@H](-[#6]-[#6]-[#6]-c1cccnc1)-[#7]-[#6](=O)\[#6]=[#6]\[#6]=[#6](\c1ccc(-[#8]-[#6])cc1)-c1ccc(-[#8]-[#6])cc1
InChI Key: InChIKey=LWZKRPZJSXUBIQ-JHVZDVHPSA-N
Activity Spreadsheet -- Enzyme Inhibition Constant Data from BindingDB
Found 1 hit for monomerid = 50018358
Trg + Lig
Ki
nM
ΔG°
kcal/mole
IC50
nM
Kd
nM
EC50/IC50
nM
koff
s-1
kon
M-1s-1
pHTemp
°C
Platelet-activating factor receptor
(Homo sapiens (Human))
BDBM50018358
(5,5-Bis-(4-methoxy-phenyl)-penta-2,4-dienoic acid ...)
Show SMILES [#6]-[#6]-[#6@@H](-[#6]-[#6]-[#6]-c1cccnc1)-[#7]-[#6](=O)\[#6]=[#6]\[#6]=[#6](\c1ccc(-[#8]-[#6])cc1)-c1ccc(-[#8]-[#6])cc1
Show InChI InChI=1S/C30H34N2O3/c1-4-26(10-5-8-23-9-7-21-31-22-23)32-30(33)12-6-11-29(24-13-17-27(34-2)18-14-24)25-15-19-28(35-3)20-16-25/h6-7,9,11-22,26H,4-5,8,10H2,1-3H3,(H,32,33)/b12-6+/t26-/m0/s1
Reactome pathway
n/an/a 400n/an/an/an/an/an/a
Roche Research Center
Curated by ChEMBL
Assay Description
Inhibition of [3H]-PAF binding to dog platelets.
J Med Chem 32: 1820-35 (1989)
BindingDB Entry DOI: 10.7270/Q2NZ86MR