null
SMILES: O=[#6](-[#6]-[#6]\[#6]=[#6](/c1ccccc1)-c1ccccc1)-[#7]-[#6]-[#6]-[#6]-[#6]-c1cccnc1
InChI Key: InChIKey=BZVZGWHNPFAOHX-UHFFFAOYSA-N
Activity Spreadsheet -- Enzyme Inhibition Constant Data from BindingDB
Found 1 hit for monomerid = 50018373
Trg + Lig
Ki
nM
ΔG°
kcal/mole
IC50
nM
Kd
nM
EC50/IC50
nM
koff
s-1
kon
M-1s-1
pHTemp
°C
Platelet-activating factor receptor
(Homo sapiens (Human))
BDBM50018373
(5,5-Diphenyl-pent-4-enoic acid (4-pyridin-3-yl-but...)
Show SMILES O=[#6](-[#6]-[#6]\[#6]=[#6](/c1ccccc1)-c1ccccc1)-[#7]-[#6]-[#6]-[#6]-[#6]-c1cccnc1
Show InChI InChI=1S/C26H28N2O/c29-26(28-20-8-7-11-22-12-10-19-27-21-22)18-9-17-25(23-13-3-1-4-14-23)24-15-5-2-6-16-24/h1-6,10,12-17,19,21H,7-9,11,18,20H2,(H,28,29)
Reactome pathway
n/an/a 100n/an/an/an/an/an/a
Roche Research Center
Curated by ChEMBL
Assay Description
Inhibition of platelet activating factor receptor binding activity in dog platelets using [3H]-PAF as radioligand
J Med Chem 32: 1820-35 (1989)
BindingDB Entry DOI: 10.7270/Q2NZ86MR