null
SMILES: [#6]-[#8]-c1ccc(cc1)-[#6](=[#6]\[#6]=[#6]\[#6](=O)-[#7]-[#6]-[#6]-[#6]-[#8]-c1cccnc1)\c1ccc(-[#8]-[#6])cc1
InChI Key: InChIKey=WDOONJQSKBLQAF-FPYGCLRLSA-N
Activity Spreadsheet -- Enzyme Inhibition Constant Data from BindingDB
Found 1 hit for monomerid = 50018381
Trg + Lig
Ki
nM
ΔG°
kcal/mole
IC50
nM
Kd
nM
EC50/IC50
nM
koff
s-1
kon
M-1s-1
pHTemp
°C
Platelet-activating factor receptor
(Homo sapiens (Human))
BDBM50018381
(5,5-Bis-(4-methoxy-phenyl)-penta-2,4-dienoic acid ...)
Show SMILES [#6]-[#8]-c1ccc(cc1)-[#6](=[#6]\[#6]=[#6]\[#6](=O)-[#7]-[#6]-[#6]-[#6]-[#8]-c1cccnc1)\c1ccc(-[#8]-[#6])cc1
Show InChI InChI=1S/C27H28N2O4/c1-31-23-13-9-21(10-14-23)26(22-11-15-24(32-2)16-12-22)7-3-8-27(30)29-18-5-19-33-25-6-4-17-28-20-25/h3-4,6-17,20H,5,18-19H2,1-2H3,(H,29,30)/b8-3+
Reactome pathway
n/an/a 300n/an/an/an/an/an/a
Roche Research Center
Curated by ChEMBL
Assay Description
Inhibition of [3H]-PAF binding to dog platelets.
J Med Chem 32: 1820-35 (1989)
BindingDB Entry DOI: 10.7270/Q2NZ86MR