null
SMILES: Fc1ccc(cc1)-[#6](=[#6]/[#6]=[#6]/[#6](=O)-[#7]-[#6]-[#6]-[#6]-[#6]-c1cccnc1)\c1ccc(F)cc1
InChI Key: InChIKey=LAUSVRPTAXRLJF-FPYGCLRLSA-N
Activity Spreadsheet -- Enzyme Inhibition Constant Data from BindingDB
Found 1 hit for monomerid = 50018382
Trg + Lig
Ki
nM
ΔG°
kcal/mole
IC50
nM
Kd
nM
EC50/IC50
nM
koff
s-1
kon
M-1s-1
pHTemp
°C
Platelet-activating factor receptor
(Homo sapiens (Human))
BDBM50018382
(5,5-Bis-(4-fluoro-phenyl)-penta-2,4-dienoic acid (...)
Show SMILES Fc1ccc(cc1)-[#6](=[#6]/[#6]=[#6]/[#6](=O)-[#7]-[#6]-[#6]-[#6]-[#6]-c1cccnc1)\c1ccc(F)cc1
Show InChI InChI=1S/C26H24F2N2O/c27-23-13-9-21(10-14-23)25(22-11-15-24(28)16-12-22)7-3-8-26(31)30-18-2-1-5-20-6-4-17-29-19-20/h3-4,6-17,19H,1-2,5,18H2,(H,30,31)/b8-3+
Reactome pathway
n/an/a 40n/an/an/an/an/an/a
Roche Research Center
Curated by ChEMBL
Assay Description
Inhibition of platelet activating factor receptor binding activity in dog platelets using [3H]-PAF as radioligand
J Med Chem 32: 1820-35 (1989)
BindingDB Entry DOI: 10.7270/Q2NZ86MR