null
SMILES: [#6]-[#6@H](-[#6]-[#6]-[#6]-c1cccnc1)-[#7]-[#6](=O)\[#6]=[#6]\[#6]=[#6](\c1cccc(F)c1)-c1cccc(F)c1
InChI Key: InChIKey=ACLSUALHMZIIAQ-NINHTKBVSA-N
Activity Spreadsheet -- Enzyme Inhibition Constant Data from BindingDB
Found 1 hit for monomerid = 50018391
Trg + Lig
Ki
nM
ΔG°
kcal/mole
IC50
nM
Kd
nM
EC50/IC50
nM
koff
s-1
kon
M-1s-1
pHTemp
°C
Platelet-activating factor receptor
(Homo sapiens (Human))
BDBM50018391
(5,5-Bis-(3-fluoro-phenyl)-penta-2,4-dienoic acid (...)
Show SMILES [#6]-[#6@H](-[#6]-[#6]-[#6]-c1cccnc1)-[#7]-[#6](=O)\[#6]=[#6]\[#6]=[#6](\c1cccc(F)c1)-c1cccc(F)c1
Show InChI InChI=1S/C27H26F2N2O/c1-20(7-2-8-21-9-6-16-30-19-21)31-27(32)15-5-14-26(22-10-3-12-24(28)17-22)23-11-4-13-25(29)18-23/h3-6,9-20H,2,7-8H2,1H3,(H,31,32)/b15-5+/t20-/m1/s1
Reactome pathway
n/an/a 170n/an/an/an/an/an/a
Roche Research Center
Curated by ChEMBL
Assay Description
Inhibition of platelet activating factor receptor binding activity in dog platelets using [3H]-PAF as radioligand
J Med Chem 32: 1820-35 (1989)
BindingDB Entry DOI: 10.7270/Q2NZ86MR