BDBM50018797 CHEMBL3291345
SMILES: [H][C@@]12CC[C@@](C)(c3c1c(=O)n(-c1ccccc1C(F)(F)F)n3C)C2(C)C
InChI Key: InChIKey=OUANOAMFFAKLPS-XIKOKIGWSA-N
Data: 3 IC50
Activity Spreadsheet -- Enzyme Inhibition Constant Data from BindingDB
Found 3 hits for monomerid = 50018797
Trg + Lig
Ki
nM
ΔG°
kcal/mole
IC50
nM
Kd
nM
EC50/IC50
nM
koff
s-1
kon
M-1s-1
pHTemp
°C
11-beta-Hydroxysteroid Dehydrogenase 1 (11-beta-HSD1)
(Rattus norvegicus (rat))
BDBM50018797
(CHEMBL3291345)
Show SMILES [H][C@@]12CC[C@@](C)(c3c1c(=O)n(-c1ccccc1C(F)(F)F)n3C)C2(C)C |r,wU:4.4,1.0,(19.67,-12.49,;19.67,-10.99,;20.97,-10.25,;20.97,-8.75,;19.67,-8.01,;19.25,-6.57,;18.38,-8.75,;18.38,-10.25,;16.96,-10.72,;16.5,-12.13,;16.09,-9.5,;14.54,-9.5,;13.78,-10.84,;12.24,-10.84,;11.46,-9.5,;12.23,-8.16,;13.78,-8.16,;13.37,-6.66,;14.46,-5.57,;11.88,-6.27,;12.97,-5.16,;16.96,-8.3,;16.48,-6.83,;20.54,-9.5,;22.03,-10.35,;22.03,-8.64,)|
Show InChI InChI=1S/C19H21F3N2O/c1-17(2)12-9-10-18(17,3)15-14(12)16(25)24(23(15)4)13-8-6-5-7-11(13)19(20,21)22/h5-8,12H,9-10H2,1-4H3/t12-,18+/m1/s1
n/an/a 10n/an/an/an/an/an/a
Hoffmann-La Roche Inc.
Curated by ChEMBL
Assay Description
Inhibition of rat 11betaHSD1 assessed as reduction of cortisone to cortisol by ELISA
Bioorg Med Chem Lett 24: 2707-11 (2014)
Article DOI: 10.1016/j.bmcl.2014.04.049
BindingDB Entry DOI: 10.7270/Q2TM7CPF
Cytochrome P450 3A4
(Homo sapiens (Human))
BDBM50018797
(CHEMBL3291345)
Show SMILES [H][C@@]12CC[C@@](C)(c3c1c(=O)n(-c1ccccc1C(F)(F)F)n3C)C2(C)C |r,wU:4.4,1.0,(19.67,-12.49,;19.67,-10.99,;20.97,-10.25,;20.97,-8.75,;19.67,-8.01,;19.25,-6.57,;18.38,-8.75,;18.38,-10.25,;16.96,-10.72,;16.5,-12.13,;16.09,-9.5,;14.54,-9.5,;13.78,-10.84,;12.24,-10.84,;11.46,-9.5,;12.23,-8.16,;13.78,-8.16,;13.37,-6.66,;14.46,-5.57,;11.88,-6.27,;12.97,-5.16,;16.96,-8.3,;16.48,-6.83,;20.54,-9.5,;22.03,-10.35,;22.03,-8.64,)|
Show InChI InChI=1S/C19H21F3N2O/c1-17(2)12-9-10-18(17,3)15-14(12)16(25)24(23(15)4)13-8-6-5-7-11(13)19(20,21)22/h5-8,12H,9-10H2,1-4H3/t12-,18+/m1/s1
Reactome pathway
n/an/a 2.26E+4n/an/an/an/an/an/a
Hoffmann-La Roche Inc.
Curated by ChEMBL
Assay Description
Inhibition of CYP3A4 (unknown origin)
Bioorg Med Chem Lett 24: 2707-11 (2014)
Article DOI: 10.1016/j.bmcl.2014.04.049
BindingDB Entry DOI: 10.7270/Q2TM7CPF
11-beta-hydroxysteroid dehydrogenase 1
(Homo sapiens (Human))
BDBM50018797
(CHEMBL3291345)
Show SMILES [H][C@@]12CC[C@@](C)(c3c1c(=O)n(-c1ccccc1C(F)(F)F)n3C)C2(C)C |r,wU:4.4,1.0,(19.67,-12.49,;19.67,-10.99,;20.97,-10.25,;20.97,-8.75,;19.67,-8.01,;19.25,-6.57,;18.38,-8.75,;18.38,-10.25,;16.96,-10.72,;16.5,-12.13,;16.09,-9.5,;14.54,-9.5,;13.78,-10.84,;12.24,-10.84,;11.46,-9.5,;12.23,-8.16,;13.78,-8.16,;13.37,-6.66,;14.46,-5.57,;11.88,-6.27,;12.97,-5.16,;16.96,-8.3,;16.48,-6.83,;20.54,-9.5,;22.03,-10.35,;22.03,-8.64,)|
Show InChI InChI=1S/C19H21F3N2O/c1-17(2)12-9-10-18(17,3)15-14(12)16(25)24(23(15)4)13-8-6-5-7-11(13)19(20,21)22/h5-8,12H,9-10H2,1-4H3/t12-,18+/m1/s1
Reactome pathway
n/an/a 13n/an/an/an/an/an/a
Hoffmann-La Roche Inc.
Curated by ChEMBL
Assay Description
Inhibition of full-length human 11betaHSD1 expressed in HEK293 cells assessed as cortisol level by competitive ELISA
Bioorg Med Chem Lett 24: 2707-11 (2014)
Article DOI: 10.1016/j.bmcl.2014.04.049
BindingDB Entry DOI: 10.7270/Q2TM7CPF