BDBM50018802 CHEMBL3291354
SMILES: [H][C@@]12CC[C@@](C)(c3c1c(=O)n(-c1ccccc1Cl)n3C)C2(C)C
InChI Key: InChIKey=LDOLONWICSGMOO-ZMZPIMSZSA-N
Data: 3 IC50
Activity Spreadsheet -- Enzyme Inhibition Constant Data from BindingDB
Found 3 hits for monomerid = 50018802
Trg + Lig
Ki
nM
ΔG°
kcal/mole
IC50
nM
Kd
nM
EC50/IC50
nM
koff
s-1
kon
M-1s-1
pHTemp
°C
11-beta-hydroxysteroid dehydrogenase 1
(Homo sapiens (Human))
BDBM50018802
(CHEMBL3291354)
Show SMILES [H][C@@]12CC[C@@](C)(c3c1c(=O)n(-c1ccccc1Cl)n3C)C2(C)C |r,wU:4.4,1.0,(22.13,-16.72,;22.13,-15.22,;23.42,-14.48,;23.42,-12.98,;22.13,-12.23,;21.71,-10.79,;20.84,-12.98,;20.84,-14.48,;19.42,-14.94,;18.96,-16.36,;18.54,-13.73,;16.99,-13.72,;16.23,-12.39,;14.69,-12.38,;13.91,-13.72,;14.69,-15.07,;16.23,-15.06,;17.01,-16.4,;19.42,-12.52,;18.94,-11.05,;22.99,-13.72,;24.49,-14.58,;24.49,-12.86,)|
Show InChI InChI=1S/C18H21ClN2O/c1-17(2)11-9-10-18(17,3)15-14(11)16(22)21(20(15)4)13-8-6-5-7-12(13)19/h5-8,11H,9-10H2,1-4H3/t11-,18+/m1/s1
Reactome pathway
n/an/a 14n/an/an/an/an/an/a
Hoffmann-La Roche Inc.
Curated by ChEMBL
Assay Description
Inhibition of full-length human 11betaHSD1 expressed in HEK293 cells assessed as cortisol level by competitive ELISA
Bioorg Med Chem Lett 24: 2707-11 (2014)
Article DOI: 10.1016/j.bmcl.2014.04.049
BindingDB Entry DOI: 10.7270/Q2TM7CPF
Cytochrome P450 3A4
(Homo sapiens (Human))
BDBM50018802
(CHEMBL3291354)
Show SMILES [H][C@@]12CC[C@@](C)(c3c1c(=O)n(-c1ccccc1Cl)n3C)C2(C)C |r,wU:4.4,1.0,(22.13,-16.72,;22.13,-15.22,;23.42,-14.48,;23.42,-12.98,;22.13,-12.23,;21.71,-10.79,;20.84,-12.98,;20.84,-14.48,;19.42,-14.94,;18.96,-16.36,;18.54,-13.73,;16.99,-13.72,;16.23,-12.39,;14.69,-12.38,;13.91,-13.72,;14.69,-15.07,;16.23,-15.06,;17.01,-16.4,;19.42,-12.52,;18.94,-11.05,;22.99,-13.72,;24.49,-14.58,;24.49,-12.86,)|
Show InChI InChI=1S/C18H21ClN2O/c1-17(2)11-9-10-18(17,3)15-14(11)16(22)21(20(15)4)13-8-6-5-7-12(13)19/h5-8,11H,9-10H2,1-4H3/t11-,18+/m1/s1
Reactome pathway
n/an/a>5.00E+4n/an/an/an/an/an/a
Hoffmann-La Roche Inc.
Curated by ChEMBL
Assay Description
Inhibition of CYP3A4 (unknown origin)
Bioorg Med Chem Lett 24: 2707-11 (2014)
Article DOI: 10.1016/j.bmcl.2014.04.049
BindingDB Entry DOI: 10.7270/Q2TM7CPF
11-beta-Hydroxysteroid Dehydrogenase 1 (11-beta-HSD1)
(Rattus norvegicus (rat))
BDBM50018802
(CHEMBL3291354)
Show SMILES [H][C@@]12CC[C@@](C)(c3c1c(=O)n(-c1ccccc1Cl)n3C)C2(C)C |r,wU:4.4,1.0,(22.13,-16.72,;22.13,-15.22,;23.42,-14.48,;23.42,-12.98,;22.13,-12.23,;21.71,-10.79,;20.84,-12.98,;20.84,-14.48,;19.42,-14.94,;18.96,-16.36,;18.54,-13.73,;16.99,-13.72,;16.23,-12.39,;14.69,-12.38,;13.91,-13.72,;14.69,-15.07,;16.23,-15.06,;17.01,-16.4,;19.42,-12.52,;18.94,-11.05,;22.99,-13.72,;24.49,-14.58,;24.49,-12.86,)|
Show InChI InChI=1S/C18H21ClN2O/c1-17(2)11-9-10-18(17,3)15-14(11)16(22)21(20(15)4)13-8-6-5-7-12(13)19/h5-8,11H,9-10H2,1-4H3/t11-,18+/m1/s1
n/an/a 39n/an/an/an/an/an/a
Hoffmann-La Roche Inc.
Curated by ChEMBL
Assay Description
Inhibition of rat 11betaHSD1 assessed as reduction of cortisone to cortisol by ELISA
Bioorg Med Chem Lett 24: 2707-11 (2014)
Article DOI: 10.1016/j.bmcl.2014.04.049
BindingDB Entry DOI: 10.7270/Q2TM7CPF