BDBM50018810 CHEMBL3291338
SMILES: [H][C@]12CC[C@](C)(c3c1c(=O)n(-c1ccccc1)n3C)C2(C)C
InChI Key: InChIKey=JTCWAXISFRLVOA-SCLBCKFNSA-N
Data: 2 IC50
Activity Spreadsheet -- Enzyme Inhibition Constant Data from BindingDB
Found 2 hits for monomerid = 50018810
Trg + Lig
Ki
nM
ΔG°
kcal/mole
IC50
nM
Kd
nM
EC50/IC50
nM
koff
s-1
kon
M-1s-1
pHTemp
°C
11-beta-Hydroxysteroid Dehydrogenase 1 (11-beta-HSD1)
(Rattus norvegicus (rat))
BDBM50018810
(CHEMBL3291338)
Show SMILES [H][C@]12CC[C@](C)(c3c1c(=O)n(-c1ccccc1)n3C)C2(C)C |r|
Show InChI InChI=1S/C18H22N2O/c1-17(2)13-10-11-18(17,3)15-14(13)16(21)20(19(15)4)12-8-6-5-7-9-12/h5-9,13H,10-11H2,1-4H3/t13-,18+/m0/s1
n/an/a 116n/an/an/an/an/an/a
Hoffmann-La Roche Inc.
Curated by ChEMBL
Assay Description
Inhibition of rat 11betaHSD1 assessed as reduction of cortisone to cortisol by ELISA
Bioorg Med Chem Lett 24: 2707-11 (2014)
Article DOI: 10.1016/j.bmcl.2014.04.049
BindingDB Entry DOI: 10.7270/Q2TM7CPF
11-beta-hydroxysteroid dehydrogenase 1
(Homo sapiens (Human))
BDBM50018810
(CHEMBL3291338)
Show SMILES [H][C@]12CC[C@](C)(c3c1c(=O)n(-c1ccccc1)n3C)C2(C)C |r|
Show InChI InChI=1S/C18H22N2O/c1-17(2)13-10-11-18(17,3)15-14(13)16(21)20(19(15)4)12-8-6-5-7-9-12/h5-9,13H,10-11H2,1-4H3/t13-,18+/m0/s1
Reactome pathway
n/an/a 60n/an/an/an/an/an/a
Hoffmann-La Roche Inc.
Curated by ChEMBL
Assay Description
Inhibition of full-length human 11betaHSD1 expressed in HEK293 cells assessed as cortisol level by competitive ELISA
Bioorg Med Chem Lett 24: 2707-11 (2014)
Article DOI: 10.1016/j.bmcl.2014.04.049
BindingDB Entry DOI: 10.7270/Q2TM7CPF