BDBM50019219 CCK antagonist synthetic 20::CHEMBL70456::{3-[(1H-Indole-2-carbonyl)-amino]-2-oxo-5-phenyl-2,3-dihydro-benzo[e][1,4]diazepin-1-yl}-acetic acid: 0.3C4H10O. CH2Cl3
SMILES: OC(=O)CN1c2ccccc2C(=NC(NC(=O)c2cc3ccccc3[nH]2)C1=O)c1ccccc1
InChI Key: InChIKey=CTAHPXXZSACISG-UHFFFAOYSA-N
Data: 2 KI  3 IC50
Activity Spreadsheet -- Enzyme Inhibition Constant Data from BindingDB
Found 5 hits for monomerid = 50019219
Trg + Lig
Ki
nM
ΔG°
kcal/mole
IC50
nM
Kd
nM
EC50/IC50
nM
koff
s-1
kon
M-1s-1
pHTemp
°C
Cholecystokinin
(RAT)
BDBM50019219
(CCK antagonist synthetic 20 | CHEMBL70456 | {3-[(1...)
Show SMILES OC(=O)CN1c2ccccc2C(=NC(NC(=O)c2cc3ccccc3[nH]2)C1=O)c1ccccc1 |c:12|
Show InChI InChI=1S/C26H20N4O4/c31-22(32)15-30-21-13-7-5-11-18(21)23(16-8-2-1-3-9-16)28-24(26(30)34)29-25(33)20-14-17-10-4-6-12-19(17)27-20/h1-14,24,27H,15H2,(H,29,33)(H,31,32)
Reactome pathway
1.40n/an/an/an/an/an/an/an/a
Merck Sharp & Dohme Research Laboratories
Curated by PDSP Ki Database
Proc Natl Acad Sci U S A 83: 4918-22 (1986)
Article DOI: 10.1073/pnas.83.13.4918
BindingDB Entry DOI: 10.7270/Q2445K05
GABA A Benzodiazepine
(GUINEA PIG)
BDBM50019219
(CCK antagonist synthetic 20 | CHEMBL70456 | {3-[(1...)
Show SMILES OC(=O)CN1c2ccccc2C(=NC(NC(=O)c2cc3ccccc3[nH]2)C1=O)c1ccccc1 |c:12|
Show InChI InChI=1S/C26H20N4O4/c31-22(32)15-30-21-13-7-5-11-18(21)23(16-8-2-1-3-9-16)28-24(26(30)34)29-25(33)20-14-17-10-4-6-12-19(17)27-20/h1-14,24,27H,15H2,(H,29,33)(H,31,32)
>1.00E+4n/an/an/an/an/an/an/an/a
Merck Sharp & Dohme Research Laboratories
Curated by PDSP Ki Database
Proc Natl Acad Sci U S A 83: 4918-22 (1986)
Article DOI: 10.1073/pnas.83.13.4918
BindingDB Entry DOI: 10.7270/Q2445K05
Cholecystokinin receptor
(Homo sapiens (Human))
BDBM50019219
(CCK antagonist synthetic 20 | CHEMBL70456 | {3-[(1...)
Show SMILES OC(=O)CN1c2ccccc2C(=NC(NC(=O)c2cc3ccccc3[nH]2)C1=O)c1ccccc1 |c:12|
Show InChI InChI=1S/C26H20N4O4/c31-22(32)15-30-21-13-7-5-11-18(21)23(16-8-2-1-3-9-16)28-24(26(30)34)29-25(33)20-14-17-10-4-6-12-19(17)27-20/h1-14,24,27H,15H2,(H,29,33)(H,31,32)
Reactome pathway
n/an/a 650n/an/an/an/an/an/a
Merck Sharp& Dohme Research Laboratories
Curated by ChEMBL
Assay Description
Half-maximal inhibition of [125I]gastrin binding to guinea pig gastric glands
J Med Chem 31: 2235-46 (1989)
BindingDB Entry DOI: 10.7270/Q2PG1S9K
Cholecystokinin receptor
(Homo sapiens (Human))
BDBM50019219
(CCK antagonist synthetic 20 | CHEMBL70456 | {3-[(1...)
Show SMILES OC(=O)CN1c2ccccc2C(=NC(NC(=O)c2cc3ccccc3[nH]2)C1=O)c1ccccc1 |c:12|
Show InChI InChI=1S/C26H20N4O4/c31-22(32)15-30-21-13-7-5-11-18(21)23(16-8-2-1-3-9-16)28-24(26(30)34)29-25(33)20-14-17-10-4-6-12-19(17)27-20/h1-14,24,27H,15H2,(H,29,33)(H,31,32)
Reactome pathway
n/an/a 6.00E+3n/an/an/an/an/an/a
Merck Sharp& Dohme Research Laboratories
Curated by ChEMBL
Assay Description
Half-maximal inhibition of [125I]-CCK-8(+) binding to cholecystokinin receptor from guinea pig brain tissue
J Med Chem 31: 2235-46 (1989)
BindingDB Entry DOI: 10.7270/Q2PG1S9K
Cholecystokinin receptor
(RAT)
BDBM50019219
(CCK antagonist synthetic 20 | CHEMBL70456 | {3-[(1...)
Show SMILES OC(=O)CN1c2ccccc2C(=NC(NC(=O)c2cc3ccccc3[nH]2)C1=O)c1ccccc1 |c:12|
Show InChI InChI=1S/C26H20N4O4/c31-22(32)15-30-21-13-7-5-11-18(21)23(16-8-2-1-3-9-16)28-24(26(30)34)29-25(33)20-14-17-10-4-6-12-19(17)27-20/h1-14,24,27H,15H2,(H,29,33)(H,31,32)
Reactome pathway
n/an/a 1.40n/an/an/an/an/an/a
Merck Sharp& Dohme Research Laboratories
Curated by ChEMBL
Assay Description
Half-maximal inhibition of [125I]CCK-33 binding to cholecystokinin A receptor from rat pancreatic tissue
J Med Chem 31: 2235-46 (1989)
BindingDB Entry DOI: 10.7270/Q2PG1S9K