BDBM50019388 6-Amino-2-{4-[(2,4-diamino-pteridin-6-ylmethyl)-methyl-amino]-benzoylamino}-hexanoic acid::6-amino-2-(4-(((2,4-diaminopteridin-6-yl)methyl)(methyl)amino)benzamido)hexanoic acid::CHEMBL418165
SMILES: CN(Cc1cnc2nc(N)nc(N)c2n1)c1ccc(cc1)C(=O)NC(CCCCN)C(O)=O
InChI Key: InChIKey=XERJQLWAFDLUGV-UHFFFAOYSA-N
Data: 2 IC50
Activity Spreadsheet -- Enzyme Inhibition Constant Data from BindingDB
Found 2 hits for monomerid = 50019388
Trg + Lig
Ki
nM
ΔG°
kcal/mole
IC50
nM
Kd
nM
EC50/IC50
nM
koff
s-1
kon
M-1s-1
pHTemp
°C
Dihydrofolate reductase
(Gallus gallus (Chicken))
BDBM50019388
(6-Amino-2-{4-[(2,4-diamino-pteridin-6-ylmethyl)-me...)
Show SMILES CN(Cc1cnc2nc(N)nc(N)c2n1)c1ccc(cc1)C(=O)NC(CCCCN)C(O)=O
Show InChI InChI=1S/C21H27N9O3/c1-30(11-13-10-25-18-16(26-13)17(23)28-21(24)29-18)14-7-5-12(6-8-14)19(31)27-15(20(32)33)4-2-3-9-22/h5-8,10,15H,2-4,9,11,22H2,1H3,(H,27,31)(H,32,33)(H4,23,24,25,28,29)
Reactome pathway
n/an/a 130n/an/an/an/an/an/a
TBA
Curated by ChEMBL
Assay Description
Evaluated for the inhibition of chicken liver Dihydrofolate reductase by using standard enzyme assay
J Med Chem 25: 475-7 (1982)
BindingDB Entry DOI: 10.7270/Q2NP25QN
Dihydrofolate reductase
(Mus musculus (Mouse))
BDBM50019388
(6-Amino-2-{4-[(2,4-diamino-pteridin-6-ylmethyl)-me...)
Show SMILES CN(Cc1cnc2nc(N)nc(N)c2n1)c1ccc(cc1)C(=O)NC(CCCCN)C(O)=O
Show InChI InChI=1S/C21H27N9O3/c1-30(11-13-10-25-18-16(26-13)17(23)28-21(24)29-18)14-7-5-12(6-8-14)19(31)27-15(20(32)33)4-2-3-9-22/h5-8,10,15H,2-4,9,11,22H2,1H3,(H,27,31)(H,32,33)(H4,23,24,25,28,29)
Reactome pathway
n/an/a 65n/an/an/an/an/an/a
TBA
Curated by ChEMBL
Assay Description
Compound was tested for its ability to inhibit purified dihydrofolate reductase(DHFR) from L1210/R81 cells
J Med Chem 29: 655-60 (1986)
BindingDB Entry DOI: 10.7270/Q2RR1ZTR