BDBM50019458 CHEMBL45063::N-[4-(2-Fluoro-benzoyl)-2,5-dimethyl-2H-pyrazol-3-yl]-2-[3-(2-methyl-piperidin-1-yl)-propylamino]-acetamide
SMILES: CC1CCCCN1CCCNCC(=O)Nc1c(C(=O)c2ccccc2F)c(C)nn1C
InChI Key: InChIKey=QUTKAZRSRKFOMI-UHFFFAOYSA-N
Data: 10 IC50
Activity Spreadsheet -- Enzyme Inhibition Constant Data from BindingDB
Found 10 hits for monomerid = 50019458
Trg + Lig
Ki
nM
ΔG°
kcal/mole
IC50
nM
Kd
nM
EC50/IC50
nM
koff
s-1
kon
M-1s-1
pHTemp
°C
Beta-1 adrenergic receptor
(Rattus norvegicus (Rat))
BDBM50019458
(CHEMBL45063 | N-[4-(2-Fluoro-benzoyl)-2,5-dimethyl...)
Show SMILES CC1CCCCN1CCCNCC(=O)Nc1c(C(=O)c2ccccc2F)c(C)nn1C
Show InChI InChI=1S/C23H32FN5O2/c1-16-9-6-7-13-29(16)14-8-12-25-15-20(30)26-23-21(17(2)27-28(23)3)22(31)18-10-4-5-11-19(18)24/h4-5,10-11,16,25H,6-9,12-15H2,1-3H3,(H,26,30)
Reactome pathway
n/an/a>1.00E+4n/an/an/an/an/an/a
TBA
Curated by ChEMBL
Assay Description
Binding affinity against beta-1 adrenergic receptor in rat brain using [3H]-DHA
J Med Chem 29: 1628-37 (1986)
BindingDB Entry DOI: 10.7270/Q2319TVF
Beta-2 adrenergic receptor
(Rattus norvegicus)
BDBM50019458
(CHEMBL45063 | N-[4-(2-Fluoro-benzoyl)-2,5-dimethyl...)
Show SMILES CC1CCCCN1CCCNCC(=O)Nc1c(C(=O)c2ccccc2F)c(C)nn1C
Show InChI InChI=1S/C23H32FN5O2/c1-16-9-6-7-13-29(16)14-8-12-25-15-20(30)26-23-21(17(2)27-28(23)3)22(31)18-10-4-5-11-19(18)24/h4-5,10-11,16,25H,6-9,12-15H2,1-3H3,(H,26,30)
n/an/a>1.00E+4n/an/an/an/an/an/a
TBA
Curated by ChEMBL
Assay Description
Binding affinity against beta-2 adrenergic receptor in rat brain using [3H]-DHA
J Med Chem 29: 1628-37 (1986)
BindingDB Entry DOI: 10.7270/Q2319TVF
Adenosine receptor A1
(Rattus norvegicus (rat))
BDBM50019458
(CHEMBL45063 | N-[4-(2-Fluoro-benzoyl)-2,5-dimethyl...)
Show SMILES CC1CCCCN1CCCNCC(=O)Nc1c(C(=O)c2ccccc2F)c(C)nn1C
Show InChI InChI=1S/C23H32FN5O2/c1-16-9-6-7-13-29(16)14-8-12-25-15-20(30)26-23-21(17(2)27-28(23)3)22(31)18-10-4-5-11-19(18)24/h4-5,10-11,16,25H,6-9,12-15H2,1-3H3,(H,26,30)
Reactome pathway
n/an/a>1.00E+4n/an/an/an/an/an/a
TBA
Curated by ChEMBL
Assay Description
Binding affinity towards rat brain adenosine A1 receptor using [3H]- CHA
J Med Chem 29: 1628-37 (1986)
BindingDB Entry DOI: 10.7270/Q2319TVF
Serotonin 1 (5-HT1) receptor
(RAT-Rattus norvegicus (rat)-Rattus norvegicus (Rat...)
BDBM50019458
(CHEMBL45063 | N-[4-(2-Fluoro-benzoyl)-2,5-dimethyl...)
Show SMILES CC1CCCCN1CCCNCC(=O)Nc1c(C(=O)c2ccccc2F)c(C)nn1C
Show InChI InChI=1S/C23H32FN5O2/c1-16-9-6-7-13-29(16)14-8-12-25-15-20(30)26-23-21(17(2)27-28(23)3)22(31)18-10-4-5-11-19(18)24/h4-5,10-11,16,25H,6-9,12-15H2,1-3H3,(H,26,30)
n/an/a>1.00E+4n/an/an/an/an/an/a
TBA
Curated by ChEMBL
Assay Description
Binding affinity against serotonin-1 receptor in rat brain using [3H]5-HT
J Med Chem 29: 1628-37 (1986)
BindingDB Entry DOI: 10.7270/Q2319TVF
Muscarinic acetylcholine receptor
(RAT)
BDBM50019458
(CHEMBL45063 | N-[4-(2-Fluoro-benzoyl)-2,5-dimethyl...)
Show SMILES CC1CCCCN1CCCNCC(=O)Nc1c(C(=O)c2ccccc2F)c(C)nn1C
Show InChI InChI=1S/C23H32FN5O2/c1-16-9-6-7-13-29(16)14-8-12-25-15-20(30)26-23-21(17(2)27-28(23)3)22(31)18-10-4-5-11-19(18)24/h4-5,10-11,16,25H,6-9,12-15H2,1-3H3,(H,26,30)
NCI pathway
Reactome pathway
n/an/a>1.00E+4n/an/an/an/an/an/a
TBA
Curated by ChEMBL
Assay Description
Binding affinity against Muscarinic acetylcholine receptor in rat brain using [3H]- QNB
J Med Chem 29: 1628-37 (1986)
BindingDB Entry DOI: 10.7270/Q2319TVF
Dopamine receptor
(Rattus norvegicus (rat)-RAT-Rattus norvegicus (Rat...)
BDBM50019458
(CHEMBL45063 | N-[4-(2-Fluoro-benzoyl)-2,5-dimethyl...)
Show SMILES CC1CCCCN1CCCNCC(=O)Nc1c(C(=O)c2ccccc2F)c(C)nn1C
Show InChI InChI=1S/C23H32FN5O2/c1-16-9-6-7-13-29(16)14-8-12-25-15-20(30)26-23-21(17(2)27-28(23)3)22(31)18-10-4-5-11-19(18)24/h4-5,10-11,16,25H,6-9,12-15H2,1-3H3,(H,26,30)
Reactome pathway
n/an/a>1.00E+4n/an/an/an/an/an/a
TBA
Curated by ChEMBL
Assay Description
Binding affinity against dopamine receptor in rat striatal membrane using [3H]haloperidol
J Med Chem 29: 1628-37 (1986)
BindingDB Entry DOI: 10.7270/Q2319TVF
Alpha-1 Adrenergic Receptor/ adrenergic receptor/ adrenergic receptor
(Rattus norvegicus (rat)-Rattus norvegicus (Rat))
BDBM50019458
(CHEMBL45063 | N-[4-(2-Fluoro-benzoyl)-2,5-dimethyl...)
Show SMILES CC1CCCCN1CCCNCC(=O)Nc1c(C(=O)c2ccccc2F)c(C)nn1C
Show InChI InChI=1S/C23H32FN5O2/c1-16-9-6-7-13-29(16)14-8-12-25-15-20(30)26-23-21(17(2)27-28(23)3)22(31)18-10-4-5-11-19(18)24/h4-5,10-11,16,25H,6-9,12-15H2,1-3H3,(H,26,30)
Reactome pathway
n/an/a>1.00E+4n/an/an/an/an/an/a
TBA
Curated by ChEMBL
Assay Description
Binding affinity against alpha-1 adrenergic receptor in rat brain using [3H]- WB-4101
J Med Chem 29: 1628-37 (1986)
BindingDB Entry DOI: 10.7270/Q2319TVF
Adrenergic receptor alpha-2
(RAT-NEONATAL RAT-Rattus norvegicus (rat))
BDBM50019458
(CHEMBL45063 | N-[4-(2-Fluoro-benzoyl)-2,5-dimethyl...)
Show SMILES CC1CCCCN1CCCNCC(=O)Nc1c(C(=O)c2ccccc2F)c(C)nn1C
Show InChI InChI=1S/C23H32FN5O2/c1-16-9-6-7-13-29(16)14-8-12-25-15-20(30)26-23-21(17(2)27-28(23)3)22(31)18-10-4-5-11-19(18)24/h4-5,10-11,16,25H,6-9,12-15H2,1-3H3,(H,26,30)
n/an/a>1.00E+4n/an/an/an/an/an/a
TBA
Curated by ChEMBL
Assay Description
Binding affinity against alpha-2 adrenergic receptor in rat brain using [3H]- clonidine
J Med Chem 29: 1628-37 (1986)
BindingDB Entry DOI: 10.7270/Q2319TVF
Dopamine receptor
(Rattus norvegicus (rat)-RAT-Rattus norvegicus (Rat...)
BDBM50019458
(CHEMBL45063 | N-[4-(2-Fluoro-benzoyl)-2,5-dimethyl...)
Show SMILES CC1CCCCN1CCCNCC(=O)Nc1c(C(=O)c2ccccc2F)c(C)nn1C
Show InChI InChI=1S/C23H32FN5O2/c1-16-9-6-7-13-29(16)14-8-12-25-15-20(30)26-23-21(17(2)27-28(23)3)22(31)18-10-4-5-11-19(18)24/h4-5,10-11,16,25H,6-9,12-15H2,1-3H3,(H,26,30)
Reactome pathway
n/an/a>1.00E+4n/an/an/an/an/an/a
TBA
Curated by ChEMBL
Assay Description
Binding affinity for dopamine receptor in rat striatal membrane using [3H]haloperidol as radioligand
J Med Chem 29: 1628-37 (1986)
BindingDB Entry DOI: 10.7270/Q2319TVF
Serotonin 2 (5-HT2) receptor
(Rattus norvegicus (rat)-RAT-Rattus norvegicus (Rat...)
BDBM50019458
(CHEMBL45063 | N-[4-(2-Fluoro-benzoyl)-2,5-dimethyl...)
Show SMILES CC1CCCCN1CCCNCC(=O)Nc1c(C(=O)c2ccccc2F)c(C)nn1C
Show InChI InChI=1S/C23H32FN5O2/c1-16-9-6-7-13-29(16)14-8-12-25-15-20(30)26-23-21(17(2)27-28(23)3)22(31)18-10-4-5-11-19(18)24/h4-5,10-11,16,25H,6-9,12-15H2,1-3H3,(H,26,30)
n/an/a>1.00E+4n/an/an/an/an/an/a
TBA
Curated by ChEMBL
Assay Description
Binding affinity towards 5-hydroxytryptamine 2 receptor in rat brain using [3H]spiroperidol
J Med Chem 29: 1628-37 (1986)
BindingDB Entry DOI: 10.7270/Q2319TVF