null
SMILES: CCSCCn1c(nc2ccccc12)N1CCN(C)CC1
InChI Key: InChIKey=QYRHKQKNXCZUQV-UHFFFAOYSA-N
Activity Spreadsheet -- Enzyme Inhibition Constant Data from BindingDB
Found 1 hit for monomerid = 50019593
Trg + Lig
Ki
nM
ΔG°
kcal/mole
IC50
nM
Kd
nM
EC50/IC50
nM
koff
s-1
kon
M-1s-1
pHTemp
°C
Histamine H1 receptor
(Cavia porcellus (domestic guinea pig))
BDBM50019593
(1-(2-Ethylsulfanyl-ethyl)-2-(4-methyl-piperazin-1-...)
Show SMILES CCSCCn1c(nc2ccccc12)N1CCN(C)CC1
Show InChI InChI=1S/C16H24N4S/c1-3-21-13-12-20-15-7-5-4-6-14(15)17-16(20)19-10-8-18(2)9-11-19/h4-7H,3,8-13H2,1-2H3
n/an/a 19n/an/an/an/an/an/a
TBA
Curated by ChEMBL
Assay Description
In vitro inhibition of histamine-induced contractions in guinea pig ileum
J Med Chem 29: 1178-83 (1987)
BindingDB Entry DOI: 10.7270/Q2QR4XPC