null
SMILES: CN1CCN(CC1)c1nc2ccccc2n1CCOCC#C
InChI Key: InChIKey=HWAPLEOLHGTJGJ-UHFFFAOYSA-N
Activity Spreadsheet -- Enzyme Inhibition Constant Data from BindingDB
Found 1 hit for monomerid = 50019596
Trg + Lig
Ki
nM
ΔG°
kcal/mole
IC50
nM
Kd
nM
EC50/IC50
nM
koff
s-1
kon
M-1s-1
pHTemp
°C
Histamine H1 receptor
(Cavia porcellus (domestic guinea pig))
BDBM50019596
(2-(4-Methyl-piperazin-1-yl)-1-(2-prop-2-ynyloxy-et...)
Show SMILES CN1CCN(CC1)c1nc2ccccc2n1CCOCC#C
Show InChI InChI=1S/C17H22N4O/c1-3-13-22-14-12-21-16-7-5-4-6-15(16)18-17(21)20-10-8-19(2)9-11-20/h1,4-7H,8-14H2,2H3
n/an/a 12n/an/an/an/an/an/a
TBA
Curated by ChEMBL
Assay Description
In vitro inhibition of histamine-induced contractions in guinea pig ileum
J Med Chem 29: 1178-83 (1987)
BindingDB Entry DOI: 10.7270/Q2QR4XPC