null
SMILES: CCCCCCN1CCN(CC1)c1nc2ccccc2n1CCOCC
InChI Key: InChIKey=WCXICPPUCDGOTE-UHFFFAOYSA-N
Activity Spreadsheet -- Enzyme Inhibition Constant Data from BindingDB
Found 1 hit for monomerid = 50019602
Trg + Lig
Ki
nM
ΔG°
kcal/mole
IC50
nM
Kd
nM
EC50/IC50
nM
koff
s-1
kon
M-1s-1
pHTemp
°C
Histamine H1 receptor
(Cavia porcellus (domestic guinea pig))
BDBM50019602
(1-(2-Ethoxy-ethyl)-2-(4-hexyl-piperazin-1-yl)-1H-b...)
Show SMILES CCCCCCN1CCN(CC1)c1nc2ccccc2n1CCOCC
Show InChI InChI=1S/C21H34N4O/c1-3-5-6-9-12-23-13-15-24(16-14-23)21-22-19-10-7-8-11-20(19)25(21)17-18-26-4-2/h7-8,10-11H,3-6,9,12-18H2,1-2H3
n/an/a 8.60n/an/an/an/an/an/a
TBA
Curated by ChEMBL
Assay Description
In vitro inhibition of histamine-induced contractions in guinea pig ileum
J Med Chem 29: 1178-83 (1987)
BindingDB Entry DOI: 10.7270/Q2QR4XPC