null
SMILES: CN1CCCN(CC1)c1nc2ccccc2n1CCOCC=C
InChI Key: InChIKey=DSRCHWBEHJANHX-UHFFFAOYSA-N
Activity Spreadsheet -- Enzyme Inhibition Constant Data from BindingDB
Found 1 hit for monomerid = 50019618
Trg + Lig
Ki
nM
ΔG°
kcal/mole
IC50
nM
Kd
nM
EC50/IC50
nM
koff
s-1
kon
M-1s-1
pHTemp
°C
Histamine H1 receptor
(Cavia porcellus (domestic guinea pig))
BDBM50019618
(1-(2-Allyloxy-ethyl)-2-(4-methyl-[1,4]diazepan-1-y...)
Show SMILES CN1CCCN(CC1)c1nc2ccccc2n1CCOCC=C
Show InChI InChI=1S/C18H26N4O/c1-3-14-23-15-13-22-17-8-5-4-7-16(17)19-18(22)21-10-6-9-20(2)11-12-21/h3-5,7-8H,1,6,9-15H2,2H3
n/an/a 10n/an/an/an/an/an/a
TBA
Curated by ChEMBL
Assay Description
In vitro inhibition of histamine-induced contractions in guinea pig ileum
J Med Chem 29: 1178-83 (1987)
BindingDB Entry DOI: 10.7270/Q2QR4XPC